Unintelligible ivyresolve error - Required by unspecified unspecified unspecified


(Ben Spiller) #1

I’ve been trying to track down a problem in a big complex set of build scripts and was really struggling because the error message indicates a missing dependency but does not tell me what is trying to bring in the missing dependency. Instead of telling me which build script or module it depends on, it only says “Required by: unspecified:unspecified:unspecified” which is obviously not much use.

I tried running the gradle process in --debug mode and still could not see any log messages giving a clue about which part of the build scripts it was processing when it hit this problem. I’d like to request:

  • add more logging (at debug or info level) when each build script is processed (I used to find the verbose debugging from ant contained a lot more useful info than what gradle is giving me, which doesn’t even name the files that are being opened)
  • fixing whatever edge case can result in the unhelpful “unspecified:unspecified:unspecified”

15:37:22.435 [ERROR] [org.gradle.BuildExceptionReporter] Could not resolve all dependencies for configuration ‘classpath’.
15:37:22.436 [ERROR] [org.gradle.BuildExceptionReporter] > Could not resolve XXXXXX.
15:37:22.436 [ERROR] [org.gradle.BuildExceptionReporter] Required by:
15:37:22.436 [ERROR] [org.gradle.BuildExceptionReporter] unspecified:unspecified:unspecified
15:37:22.436 [ERROR] [org.gradle.BuildExceptionReporter] > No cached version listing for XXXXXX available for offline mode.

In case this helps track it down, that after a lot of debugging and trial/error I found that build script pulling it in was in an init.gradle file containing:
initscript {
dependencies {
classpath group: XXXXXX
}
}

It would have helped if the path to this init.gradle had appeared even once in the debug-level output from gradle, but it did not.

Here is the full stack trace: 15:37:22.435 [ERROR] [org.gradle.BuildExceptionReporter] * What went wrong:
15:37:22.435 [ERROR] [org.gradle.BuildExceptionReporter] Could not resolve all dependencies for configuration ‘classpath’.
15:37:22.436 [ERROR] [org.gradle.BuildExceptionReporter] > Could not resolve com.softwareag.bas:bas-plugins-init-script:[2.0, 2.1.9).
15:37:22.436 [ERROR] [org.gradle.BuildExceptionReporter] Required by:
15:37:22.436 [ERROR] [org.gradle.BuildExceptionReporter] unspecified:unspecified:unspecified
15:37:22.436 [ERROR] [org.gradle.BuildExceptionReporter] > No cached version listing for com.softwareag.bas:bas-plugins-init-script:[2.0, 2.1.9) available for offline mode.
15:37:22.437 [ERROR] [org.gradle.BuildExceptionReporter]
15:37:22.437 [ERROR] [org.gradle.BuildExceptionReporter] * Exception is:
15:37:22.439 [ERROR] [org.gradle.BuildExceptionReporter] org.gradle.api.artifacts.ResolveException: Could not resolve all dependencies for configuration ‘classpath’.
15:37:22.439 [ERROR] [org.gradle.BuildExceptionReporter] at org.gradle.api.internal.artifacts.ivyservice.DefaultLenientConfiguration.rethrowFailure(DefaultLenientConfiguration.java:62)
15:37:22.439 [ERROR] [org.gradle.BuildExceptionReporter] at org.gradle.api.internal.artifacts.ivyservice.DefaultResolvedConfiguration.rethrowFailure(DefaultResolvedConfiguration.java:36)
15:37:22.439 [ERROR] [org.gradle.BuildExceptionReporter] at org.gradle.api.internal.artifacts.ivyservice.SelfResolvingDependencyConfigurationResolver$FilesAggregatingResolvedConfiguration.rethrowFailure(SelfResolvingDependencyConfigurationResolver.java:112)
15:37:22.440 [ERROR] [org.gradle.BuildExceptionReporter] at org.gradle.api.internal.artifacts.ivyservice.ErrorHandlingConfigurationResolver$ErrorHandlingResolvedConfiguration.rethrowFailure(ErrorHandlingConfigurationResolver.java:189)
15:37:22.440 [ERROR] [org.gradle.BuildExceptionReporter] at org.gradle.api.internal.artifacts.configurations.DefaultConfiguration$ConfigurationFileCollection.getFiles(DefaultConfiguration.java:666)
15:37:22.440 [ERROR] [org.gradle.BuildExceptionReporter] at org.gradle.api.internal.artifacts.configurations.DefaultConfiguration.getFiles(DefaultConfiguration.java:292)
15:37:22.440 [ERROR] [org.gradle.BuildExceptionReporter] at org.gradle.api.internal.artifacts.configurations.DefaultConfiguration_Decorated.getFiles(Unknown Source)
15:37:22.440 [ERROR] [org.gradle.BuildExceptionReporter] at org.gradle.api.internal.initialization.DefaultScriptHandler.getScriptClassPath(DefaultScriptHandler.java:68)
15:37:22.441 [ERROR] [org.gradle.BuildExceptionReporter] at org.gradle.plugin.use.internal.DefaultPluginRequestApplicator.defineScriptHandlerClassScope(DefaultPluginRequestApplicator.java:148)
15:37:22.441 [ERROR] [org.gradle.BuildExceptionReporter] at org.gradle.plugin.use.internal.DefaultPluginRequestApplicator.applyPlugins(DefaultPluginRequestApplicator.java:55)
15:37:22.441 [ERROR] [org.gradle.BuildExceptionReporter] at org.gradle.configuration.DefaultScriptPluginFactory$ScriptPluginImpl.apply(DefaultScriptPluginFactory.java:140)
15:37:22.441 [ERROR] [org.gradle.BuildExceptionReporter] at org.gradle.configuration.DefaultInitScriptProcessor.process(DefaultInitScriptProcessor.java:49)
15:37:22.441 [ERROR] [org.gradle.BuildExceptionReporter] at org.gradle.initialization.InitScriptHandler$1.run(InitScriptHandler.java:50)
15:37:22.442 [ERROR] [org.gradle.BuildExceptionReporter] at org.gradle.internal.Factories$1.create(Factories.java:22)
15:37:22.444 [ERROR] [org.gradle.BuildExceptionReporter] at org.gradle.internal.progress.DefaultBuildOperationExecutor.run(DefaultBuildOperationExecutor.java:90)
15:37:22.444 [ERROR] [org.gradle.BuildExceptionReporter] at org.gradle.internal.progress.DefaultBuildOperationExecutor.run(DefaultBuildOperationExecutor.java:57)
15:37:22.445 [ERROR] [org.gradle.BuildExceptionReporter] at org.gradle.initialization.InitScriptHandler.executeScripts(InitScriptHandler.java:46)
15:37:22.445 [ERROR] [org.gradle.BuildExceptionReporter] at org.gradle.initialization.DefaultGradleLauncher.doBuildStages(DefaultGradleLauncher.java:116)
15:37:22.445 [ERROR] [org.gradle.BuildExceptionReporter] at org.gradle.initialization.DefaultGradleLauncher.access$200(DefaultGradleLauncher.java:32)
15:37:22.445 [ERROR] [org.gradle.BuildExceptionReporter] at org.gradle.initialization.DefaultGradleLauncher$1.create(DefaultGradleLauncher.java:99)
15:37:22.445 [ERROR] [org.gradle.BuildExceptionReporter] at org.gradle.initialization.DefaultGradleLauncher$1.create(DefaultGradleLauncher.java:93)
15:37:22.446 [ERROR] [org.gradle.BuildExceptionReporter] at org.gradle.internal.progress.DefaultBuildOperationExecutor.run(DefaultBuildOperationExecutor.java:90)
15:37:22.446 [ERROR] [org.gradle.BuildExceptionReporter] at org.gradle.internal.progress.DefaultBuildOperationExecutor.run(DefaultBuildOperationExecutor.java:62)
15:37:22.446 [ERROR] [org.gradle.BuildExceptionReporter] at org.gradle.initialization.DefaultGradleLauncher.doBuild(DefaultGradleLauncher.java:93)
15:37:22.446 [ERROR] [org.gradle.BuildExceptionReporter] at org.gradle.initialization.DefaultGradleLauncher.run(DefaultGradleLauncher.java:82)
15:37:22.446 [ERROR] [org.gradle.BuildExceptionReporter] at org.gradle.launcher.exec.InProcessBuildActionExecuter$DefaultBuildController.run(InProcessBuildActionExecuter.java:94)
15:37:22.448 [ERROR] [org.gradle.BuildExceptionReporter] at org.gradle.tooling.internal.provider.ExecuteBuildActionRunner.run(ExecuteBuildActionRunner.java:28)
15:37:22.448 [ERROR] [org.gradle.BuildExceptionReporter] at org.gradle.launcher.exec.ChainingBuildActionRunner.run(ChainingBuildActionRunner.java:35)
15:37:22.448 [ERROR] [org.gradle.BuildExceptionReporter] at org.gradle.launcher.exec.InProcessBuildActionExecuter.execute(InProcessBuildActionExecuter.java:43)
15:37:22.449 [ERROR] [org.gradle.BuildExceptionReporter] at org.gradle.launcher.exec.InProcessBuildActionExecuter.execute(InProcessBuildActionExecuter.java:28)
15:37:22.449 [ERROR] [org.gradle.BuildExceptionReporter] at org.gradle.launcher.exec.ContinuousBuildActionExecuter.execute(ContinuousBuildActionExecuter.java:81)
15:37:22.449 [ERROR] [org.gradle.BuildExceptionReporter] at org.gradle.launcher.exec.ContinuousBuildActionExecuter.execute(ContinuousBuildActionExecuter.java:46)
15:37:22.450 [ERROR] [org.gradle.BuildExceptionReporter] at org.gradle.launcher.daemon.server.exec.ExecuteBuild.doBuild(ExecuteBuild.java:52)
15:37:22.450 [ERROR] [org.gradle.BuildExceptionReporter] at org.gradle.launcher.daemon.server.exec.BuildCommandOnly.execute(BuildCommandOnly.java:36)
15:37:22.450 [ERROR] [org.gradle.BuildExceptionReporter] at org.gradle.launcher.daemon.server.api.DaemonCommandExecution.proceed(DaemonCommandExecution.java:120)
15:37:22.450 [ERROR] [org.gradle.BuildExceptionReporter] at org.gradle.launcher.daemon.server.exec.WatchForDisconnection.execute(WatchForDisconnection.java:37)
15:37:22.451 [ERROR] [org.gradle.BuildExceptionReporter] at org.gradle.launcher.daemon.server.api.DaemonCommandExecution.proceed(DaemonCommandExecution.java:120)
15:37:22.451 [ERROR] [org.gradle.BuildExceptionReporter] at org.gradle.launcher.daemon.server.exec.ResetDeprecationLogger.execute(ResetDeprecationLogger.java:26)
15:37:22.451 [ERROR] [org.gradle.BuildExceptionReporter] at org.gradle.launcher.daemon.server.api.DaemonCommandExecution.proceed(DaemonCommandExecution.java:120)
15:37:22.452 [ERROR] [org.gradle.BuildExceptionReporter] at org.gradle.launcher.daemon.server.exec.RequestStopIfSingleUsedDaemon.execute(RequestStopIfSingleUsedDaemon.java:34)
15:37:22.452 [ERROR] [org.gradle.BuildExceptionReporter] at org.gradle.launcher.daemon.server.api.DaemonCommandExecution.proceed(DaemonCommandExecution.java:120)
15:37:22.452 [ERROR] [org.gradle.BuildExceptionReporter] at org.gradle.launcher.daemon.server.exec.ForwardClientInput$2.call(ForwardClientInput.java:74)
15:37:22.453 [ERROR] [org.gradle.BuildExceptionReporter] at org.gradle.launcher.daemon.server.exec.ForwardClientInput$2.call(ForwardClientInput.java:72)
15:37:22.453 [ERROR] [org.gradle.BuildExceptionReporter] at org.gradle.util.Swapper.swap(Swapper.java:38)
15:37:22.453 [ERROR] [org.gradle.BuildExceptionReporter] at org.gradle.launcher.daemon.server.exec.ForwardClientInput.execute(ForwardClientInput.java:72)
15:37:22.454 [ERROR] [org.gradle.BuildExceptionReporter] at org.gradle.launcher.daemon.server.api.DaemonCommandExecution.proceed(DaemonCommandExecution.java:120)
15:37:22.454 [ERROR] [org.gradle.BuildExceptionReporter] at org.gradle.launcher.daemon.server.health.DaemonHealthTracker.execute(DaemonHealthTracker.java:40)
15:37:22.454 [ERROR] [org.gradle.BuildExceptionReporter] at org.gradle.launcher.daemon.server.api.DaemonCommandExecution.proceed(DaemonCommandExecution.java:120)
15:37:22.455 [ERROR] [org.gradle.BuildExceptionReporter] at org.gradle.launcher.daemon.server.exec.LogToClient.doBuild(LogToClient.java:60)
15:37:22.455 [ERROR] [org.gradle.BuildExceptionReporter] at org.gradle.launcher.daemon.server.exec.BuildCommandOnly.execute(BuildCommandOnly.java:36)
15:37:22.455 [ERROR] [org.gradle.BuildExceptionReporter] at org.gradle.launcher.daemon.server.api.DaemonCommandExecution.proceed(DaemonCommandExecution.java:120)
15:37:22.456 [ERROR] [org.gradle.BuildExceptionReporter] at org.gradle.launcher.daemon.server.exec.EstablishBuildEnvironment.doBuild(EstablishBuildEnvironment.java:72)
15:37:22.456 [ERROR] [org.gradle.BuildExceptionReporter] at org.gradle.launcher.daemon.server.exec.BuildCommandOnly.execute(BuildCommandOnly.java:36)
15:37:22.456 [ERROR] [org.gradle.BuildExceptionReporter] at org.gradle.launcher.daemon.server.api.DaemonCommandExecution.proceed(DaemonCommandExecution.java:120)
15:37:22.457 [ERROR] [org.gradle.BuildExceptionReporter] at org.gradle.launcher.daemon.server.health.HintGCAfterBuild.execute(HintGCAfterBuild.java:41)
15:37:22.457 [ERROR] [org.gradle.BuildExceptionReporter] at org.gradle.launcher.daemon.server.api.DaemonCommandExecution.proceed(DaemonCommandExecution.java:120)
15:37:22.467 [ERROR] [org.gradle.BuildExceptionReporter] at org.gradle.launcher.daemon.server.exec.StartBuildOrRespondWithBusy$1.run(StartBuildOrRespondWithBusy.java:50)
15:37:22.468 [ERROR] [org.gradle.BuildExceptionReporter] at org.gradle.launcher.daemon.server.DaemonStateCoordinator$1.run(DaemonStateCoordinator.java:246)
15:37:22.468 [ERROR] [org.gradle.BuildExceptionReporter] at org.gradle.internal.concurrent.ExecutorPolicy$CatchAndRecordFailures.onExecute(ExecutorPolicy.java:54)
15:37:22.468 [ERROR] [org.gradle.BuildExceptionReporter] at org.gradle.internal.concurrent.StoppableExecutorImpl$1.run(StoppableExecutorImpl.java:40)
15:37:22.468 [ERROR] [org.gradle.BuildExceptionReporter] Caused by: org.gradle.internal.resolve.ModuleVersionResolveException: Could not resolve com.softwareag.bas:bas-plugins-init-script:[2.0, 2.1.9).
15:37:22.468 [ERROR] [org.gradle.BuildExceptionReporter] Required by:
15:37:22.469 [ERROR] [org.gradle.BuildExceptionReporter] unspecified:unspecified:unspecified
15:37:22.469 [ERROR] [org.gradle.BuildExceptionReporter] at org.gradle.api.internal.artifacts.ivyservice.ivyresolve.DynamicVersionResolver.resolve(DynamicVersionResolver.java:78)
15:37:22.470 [ERROR] [org.gradle.BuildExceptionReporter] at org.gradle.api.internal.artifacts.ivyservice.ivyresolve.RepositoryChainDependencyToComponentIdResolver.resolve(RepositoryChainDependencyToComponentIdResolver.java:45)
15:37:22.470 [ERROR] [org.gradle.BuildExceptionReporter] at org.gradle.api.internal.artifacts.ivyservice.resolveengine.ComponentResolversChain$DependencyToComponentIdResolverChain.resolve(ComponentResolversChain.java:136)
15:37:22.473 [ERROR] [org.gradle.BuildExceptionReporter] at org.gradle.api.internal.artifacts.ivyservice.dependencysubstitution.DependencySubstitutionResolver.resolve(DependencySubstitutionResolver.java:50)
15:37:22.473 [ERROR] [org.gradle.BuildExceptionReporter] at org.gradle.api.internal.artifacts.ivyservice.resolveengine.graph.DependencyGraphBuilder$ModuleVersionSelectorResolveState.resolveModuleRevisionId(DependencyGraphBuilder.java:868)
15:37:22.473 [ERROR] [org.gradle.BuildExceptionReporter] at org.gradle.api.internal.artifacts.ivyservice.resolveengine.graph.DependencyGraphBuilder$DependencyEdge.resolveModuleRevisionId(DependencyGraphBuilder.java:216)
15:37:22.474 [ERROR] [org.gradle.BuildExceptionReporter] at org.gradle.api.internal.artifacts.ivyservice.resolveengine.graph.DependencyGraphBuilder.traverseGraph(DependencyGraphBuilder.java:100)
15:37:22.474 [ERROR] [org.gradle.BuildExceptionReporter] at org.gradle.api.internal.artifacts.ivyservice.resolveengine.graph.DependencyGraphBuilder.resolve(DependencyGraphBuilder.java:75)
15:37:22.474 [ERROR] [org.gradle.BuildExceptionReporter] at org.gradle.api.internal.artifacts.ivyservice.resolveengine.DefaultArtifactDependencyResolver$1.execute(DefaultArtifactDependencyResolver.java:88)
15:37:22.474 [ERROR] [org.gradle.BuildExceptionReporter] at org.gradle.api.internal.artifacts.ivyservice.resolveengine.DefaultArtifactDependencyResolver$1.execute(DefaultArtifactDependencyResolver.java:78)
15:37:22.474 [ERROR] [org.gradle.BuildExceptionReporter] at org.gradle.internal.Transformers$4.transform(Transformers.java:169)
15:37:22.474 [ERROR] [org.gradle.BuildExceptionReporter] at org.gradle.api.internal.artifacts.ivyservice.DefaultIvyContextManager.withIvy(DefaultIvyContextManager.java:61)
15:37:22.475 [ERROR] [org.gradle.BuildExceptionReporter] at org.gradle.api.internal.artifacts.ivyservice.DefaultIvyContextManager.withIvy(DefaultIvyContextManager.java:39)
15:37:22.475 [ERROR] [org.gradle.BuildExceptionReporter] at org.gradle.api.internal.artifacts.ivyservice.resolveengine.DefaultArtifactDependencyResolver.resolve(DefaultArtifactDependencyResolver.java:78)
15:37:22.475 [ERROR] [org.gradle.BuildExceptionReporter] at org.gradle.api.internal.artifacts.ivyservice.CacheLockingArtifactDependencyResolver$1.run(CacheLockingArtifactDependencyResolver.java:41)
15:37:22.475 [ERROR] [org.gradle.BuildExceptionReporter] at org.gradle.internal.Factories$1.create(Factories.java:22)
15:37:22.475 [ERROR] [org.gradle.BuildExceptionReporter] at org.gradle.cache.internal.DefaultCacheAccess.useCache(DefaultCacheAccess.java:192)
15:37:22.476 [ERROR] [org.gradle.BuildExceptionReporter] at org.gradle.cache.internal.DefaultCacheAccess.useCache(DefaultCacheAccess.java:175)
15:37:22.476 [ERROR] [org.gradle.BuildExceptionReporter] at org.gradle.cache.internal.DefaultPersistentDirectoryStore.useCache(DefaultPersistentDirectoryStore.java:106)
15:37:22.476 [ERROR] [org.gradle.BuildExceptionReporter] at org.gradle.cache.internal.DefaultCacheFactory$ReferenceTrackingCache.useCache(DefaultCacheFactory.java:187)
15:37:22.476 [ERROR] [org.gradle.BuildExceptionReporter] at org.gradle.api.internal.artifacts.ivyservice.DefaultCacheLockingManager.useCache(DefaultCacheLockingManager.java:64)
15:37:22.476 [ERROR] [org.gradle.BuildExceptionReporter] at org.gradle.api.internal.artifacts.ivyservice.CacheLockingArtifactDependencyResolver.resolve(CacheLockingArtifactDependencyResolver.java:39)
15:37:22.477 [ERROR] [org.gradle.BuildExceptionReporter] at org.gradle.api.internal.artifacts.ivyservice.DefaultConfigurationResolver.resolve(DefaultConfigurationResolver.java:91)
15:37:22.477 [ERROR] [org.gradle.BuildExceptionReporter] at org.gradle.api.internal.artifacts.ivyservice.SelfResolvingDependencyConfigurationResolver.resolve(SelfResolvingDependencyConfigurationResolver.java:40)
15:37:22.477 [ERROR] [org.gradle.BuildExceptionReporter] at org.gradle.api.internal.artifacts.ivyservice.ShortCircuitEmptyConfigurationResolver.resolve(ShortCircuitEmptyConfigurationResolver.java:52)
15:37:22.477 [ERROR] [org.gradle.BuildExceptionReporter] at org.gradle.api.internal.artifacts.ivyservice.ErrorHandlingConfigurationResolver.resolve(ErrorHandlingConfigurationResolver.java:43)
15:37:22.477 [ERROR] [org.gradle.BuildExceptionReporter] at org.gradle.api.internal.artifacts.configurations.DefaultConfiguration.resolveGraphIfRequired(DefaultConfiguration.java:371)
15:37:22.478 [ERROR] [org.gradle.BuildExceptionReporter] at org.gradle.api.internal.artifacts.configurations.DefaultConfiguration.resolveNow(DefaultConfiguration.java:346)
15:37:22.478 [ERROR] [org.gradle.BuildExceptionReporter] at org.gradle.api.internal.artifacts.configurations.DefaultConfiguration.getResolvedConfiguration(DefaultConfiguration.java:339)
15:37:22.478 [ERROR] [org.gradle.BuildExceptionReporter] at org.gradle.api.internal.artifacts.configurations.DefaultConfiguration_Decorated.getResolvedConfiguration(Unknown Source)
15:37:22.478 [ERROR] [org.gradle.BuildExceptionReporter] at org.gradle.api.internal.artifacts.configurations.DefaultConfiguration$ConfigurationFileCollection.getFiles(DefaultConfiguration.java:664)
15:37:22.479 [ERROR] [org.gradle.BuildExceptionReporter] … 55 more
15:37:22.479 [ERROR] [org.gradle.BuildExceptionReporter] Caused by: org.gradle.internal.resolve.ModuleVersionResolveException: No cached version listing for com.softwareag.bas:bas-plugins-init-script:[2.0, 2.1.9) available for offline mode.
15:37:22.480 [ERROR] [org.gradle.BuildExceptionReporter] at org.gradle.api.internal.artifacts.ivyservice.ivyresolve.StartParameterResolutionOverride$FailedRemoteAccess.listModuleVersions(StartParameterResolutionOverride.java:107)
15:37:22.480 [ERROR] [org.gradle.BuildExceptionReporter] at org.gradle.api.internal.artifacts.ivyservice.ivyresolve.CachingModuleComponentRepository$ResolveAndCacheRepositoryAccess.listModuleVersions(CachingModuleComponentRepository.java:280)
15:37:22.480 [ERROR] [org.gradle.BuildExceptionReporter] at org.gradle.api.internal.artifacts.ivyservice.ivyresolve.BaseModuleComponentRepositoryAccess.listModuleVersions(BaseModuleComponentRepositoryAccess.java:38)
15:37:22.480 [ERROR] [org.gradle.BuildExceptionReporter] at org.gradle.api.internal.artifacts.ivyservice.ivyresolve.BaseModuleComponentRepositoryAccess.listModuleVersions(BaseModuleComponentRepositoryAccess.java:38)
15:37:22.480 [ERROR] [org.gradle.BuildExceptionReporter] at org.gradle.api.internal.artifacts.ivyservice.ivyresolve.memcache.InMemoryCachedModuleComponentRepository$CachedAccess.listModuleVersions(InMemoryCachedModuleComponentRepository.java:68)
15:37:22.481 [ERROR] [org.gradle.BuildExceptionReporter] at org.gradle.api.internal.artifacts.ivyservice.ivyresolve.ErrorHandlingModuleComponentRepository$ErrorHandlingModuleComponentRepositoryAccess.listModuleVersions(ErrorHandlingModuleComponentRepository.java:80)
15:37:22.481 [ERROR] [org.gradle.BuildExceptionReporter] at org.gradle.api.internal.artifacts.ivyservice.ivyresolve.DynamicVersionResolver$VersionListResult.process(DynamicVersionResolver.java:366)
15:37:22.482 [ERROR] [org.gradle.BuildExceptionReporter] at org.gradle.api.internal.artifacts.ivyservice.ivyresolve.DynamicVersionResolver$VersionListResult.resolve(DynamicVersionResolver.java:351)
15:37:22.482 [ERROR] [org.gradle.BuildExceptionReporter] at org.gradle.api.internal.artifacts.ivyservice.ivyresolve.DynamicVersionResolver$RepositoryResolveState.resolve(DynamicVersionResolver.java:189)
15:37:22.482 [ERROR] [org.gradle.BuildExceptionReporter] at org.gradle.api.internal.artifacts.ivyservice.ivyresolve.DynamicVersionResolver.findLatestModule(DynamicVersionResolver.java:116)
15:37:22.482 [ERROR] [org.gradle.BuildExceptionReporter] at org.gradle.api.internal.artifacts.ivyservice.ivyresolve.DynamicVersionResolver.findLatestModule(DynamicVersionResolver.java:100)
15:37:22.483 [ERROR] [org.gradle.BuildExceptionReporter] at org.gradle.api.internal.artifacts.ivyservice.ivyresolve.DynamicVersionResolver.resolve(DynamicVersionResolver.java:67)
15:37:22.483 [ERROR] [org.gradle.BuildExceptionReporter] … 85 more
15:37:22.483 [ERROR] [org.gradle.BuildExceptionReporter]
15:37:22.483 [LIFECYCLE] [org.gradle.BuildResultLogger]
15:37:22.483 [LIFECYCLE] [org.gradle.BuildResultLogger] BUILD FAILED