Dependency resolution problem in gradle-1.10


(Mohammad Al- Mubin Sultan) #1

Hi i have recently upgraded to gradle 1.10 from 1.7.

Upgrading to gradle 1.10 causing the below error. I think it is getting a space while resolving dependency of “runtime(group: ‘org.apache.openejb’, name: ‘openejb-core’, version: ‘4.6.0’)”

Can anyone help me with this. This works fine in gradle 1.7

Error:

06:05:08.956 [ERROR] [org.gradle.BuildExceptionReporter] FAILURE: Build failed with an exception. 06:05:08.956 [ERROR] [org.gradle.BuildExceptionReporter]

06:05:08.956 [ERROR] [org.gradle.BuildExceptionReporter] * What went wrong: 06:05:08.956 [ERROR] [org.gradle.BuildExceptionReporter] Could not resolve all dependencies for configuration ‘:admin2:testCompile’. 06:05:08.957 [ERROR] [org.gradle.BuildExceptionReporter] > Could not resolve xbean" name:naming" rev: fo. 06:05:08.957 [ERROR] [org.gradle.BuildExceptionReporter]

Required by: 06:05:08.957 [ERROR] [org.gradle.BuildExceptionReporter]

net.therap:admin2:2014.0.0-SNAPSHOT > net.therap:test-util:2014.0.0-SNAPSHOT > org.apache.openejb:openejb-core:4.6.0 06:05:08.957 [ERROR] [org.gradle.BuildExceptionReporter]

java.lang.IllegalArgumentException (no error message) 06:05:08.957 [ERROR] [org.gradle.BuildExceptionReporter]

java.lang.IllegalArgumentException (no error message) 06:05:08.958 [ERROR] [org.gradle.BuildExceptionReporter]

06:05:08.958 [ERROR] [org.gradle.BuildExceptionReporter] * Exception is: 06:05:08.959 [ERROR] [org.gradle.BuildExceptionReporter] org.gradle.api.artifacts.ResolveException: Could not resolve all dependencies for configuration ‘:admin2:testCompile’. 06:05:08.959 [ERROR] [org.gradle.BuildExceptionReporter] at org.gradle.api.internal.artifacts.ivyservice.DefaultLenientConfiguration.rethrowFailure(DefaultLenientConfiguration.java:52) 06:05:08.983 [ERROR] [org.gradle.BuildExceptionReporter] at org.gradle.api.internal.artifacts.ivyservice.DefaultResolvedConfiguration.rethrowFailure(DefaultResolvedConfiguration.java:36) 06:05:08.984 [ERROR] [org.gradle.BuildExceptionReporter] at org.gradle.api.internal.artifacts.ivyservice.SelfResolvingDependencyResolver$FilesAggregatingResolvedConfiguration.rethrowFailure(SelfResolvingDependencyResolver.java:106) 06:05:08.984 [ERROR] [org.gradle.BuildExceptionReporter] at org.gradle.api.internal.artifacts.ivyservice.ErrorHandlingArtifactDependencyResolver$ErrorHandlingResolvedConfiguration.rethrowFailure(ErrorHandlingArtifactDependencyResolver.java:176) 06:05:08.984 [ERROR] [org.gradle.BuildExceptionReporter] at org.gradle.api.internal.artifacts.configurations.DefaultConfiguration$ConfigurationFileCollection.getFiles(DefaultConfiguration.java:465) 06:05:08.984 [ERROR] [org.gradle.BuildExceptionReporter] at org.gradle.api.internal.artifacts.configurations.DefaultConfiguration.getFiles(DefaultConfiguration.java:202) 06:05:08.984 [ERROR] [org.gradle.BuildExceptionReporter] at org.gradle.api.internal.artifacts.configurations.DefaultConfiguration_Decorated.getFiles(Unknown Source) 06:05:08.985 [ERROR] [org.gradle.BuildExceptionReporter] at org.gradle.api.internal.file.collections.DefaultFileCollectionResolveContext$FileTreeConverter.convertInto(DefaultFileCollectionResolveContext.java:191) 06:05:08.985 [ERROR] [org.gradle.BuildExceptionReporter] at org.gradle.api.internal.file.collections.DefaultFileCollectionResolveContext.doResolve(DefaultFileCollectionResolveContext.java:103) 06:05:08.985 [ERROR] [org.gradle.BuildExceptionReporter] at org.gradle.api.internal.file.collections.DefaultFileCollectionResolveContext.resolveAsFileTrees(DefaultFileCollectionResolveContext.java:75) 06:05:08.985 [ERROR] [org.gradle.BuildExceptionReporter] at org.gradle.api.internal.file.collections.DefaultFileCollectionResolveContext$FileTreeConverter.convertInto(DefaultFileCollectionResolveContext.java:182) 06:05:08.985 [ERROR] [org.gradle.BuildExceptionReporter] at org.gradle.api.internal.file.collections.DefaultFileCollectionResolveContext.doResolve(DefaultFileCollectionResolveContext.java:98) 06:05:08.985 [ERROR] [org.gradle.BuildExceptionReporter] at org.gradle.api.internal.file.collections.DefaultFileCollectionResolveContext.resolveAsFileTrees(DefaultFileCollectionResolveContext.java:75) 06:05:08.986 [ERROR] [org.gradle.BuildExceptionReporter] at org.gradle.api.internal.file.collections.DefaultFileCollectionResolveContext$FileTreeConverter.convertInto(DefaultFileCollectionResolveContext.java:182) 06:05:08.986 [ERROR] [org.gradle.BuildExceptionReporter] at org.gradle.api.internal.file.collections.DefaultFileCollectionResolveContext.doResolve(DefaultFileCollectionResolveContext.java:98) 06:05:08.986 [ERROR] [org.gradle.BuildExceptionReporter] at org.gradle.api.internal.file.collections.DefaultFileCollectionResolveContext.resolveAsFileTrees(DefaultFileCollectionResolveContext.java:75) 06:05:08.986 [ERROR] [org.gradle.BuildExceptionReporter] at org.gradle.api.internal.file.CompositeFileCollection$1.resolve(CompositeFileCollection.java:88) 06:05:08.986 [ERROR] [org.gradle.BuildExceptionReporter] at org.gradle.api.internal.file.CompositeFileCollection.getSourceCollections(CompositeFileCollection.java:143) 06:05:08.987 [ERROR] [org.gradle.BuildExceptionReporter] at org.gradle.api.internal.file.CompositeFileTree.getSourceCollections(CompositeFileTree.java:30) 06:05:08.987 [ERROR] [org.gradle.BuildExceptionReporter] at org.gradle.api.internal.file.CompositeFileCollection.getFiles(CompositeFileCollection.java:38) 06:05:08.987 [ERROR] [org.gradle.BuildExceptionReporter] at org.gradle.api.internal.changedetection.state.DefaultFileSnapshotter.snapshot(DefaultFileSnapshotter.java:44) 06:05:09.112 [ERROR] [org.gradle.BuildExceptionReporter] at org.gradle.api.internal.changedetection.rules.InputFilesStateChangeRule.create(InputFilesStateChangeRule.java:33) 06:05:09.113 [ERROR] [org.gradle.BuildExceptionReporter] at org.gradle.api.internal.changedetection.rules.TaskUpToDateState.(TaskUpToDateState.java:46) 06:05:09.113 [ERROR] [org.gradle.BuildExceptionReporter] at org.gradle.api.internal.changedetection.changes.DefaultTaskArtifactStateRepository$TaskArtifactStateImpl.getStates(DefaultTaskArtifactStateRepository.java:126) 06:05:09.113 [ERROR] [org.gradle.BuildExceptionReporter] at org.gradle.api.internal.changedetection.changes.DefaultTaskArtifactStateRepository$TaskArtifactStateImpl.isUpToDate(DefaultTaskArtifactStateRepository.java:69) 06:05:09.113 [ERROR] [org.gradle.BuildExceptionReporter] at org.gradle.api.internal.tasks.execution.SkipUpToDateTaskExecuter.execute(SkipUpToDateTaskExecuter.java:52) 06:05:09.114 [ERROR] [org.gradle.BuildExceptionReporter] at org.gradle.api.internal.tasks.execution.ValidatingTaskExecuter.execute(ValidatingTaskExecuter.java:58) 06:05:09.114 [ERROR] [org.gradle.BuildExceptionReporter] at org.gradle.api.internal.tasks.execution.SkipEmptySourceFilesTaskExecuter.execute(SkipEmptySourceFilesTaskExecuter.java:42) 06:05:09.114 [ERROR] [org.gradle.BuildExceptionReporter] at org.gradle.api.internal.tasks.execution.SkipTaskWithNoActionsExecuter.execute(SkipTaskWithNoActionsExecuter.java:52) 06:05:09.114 [ERROR] [org.gradle.BuildExceptionReporter] at org.gradle.api.internal.tasks.execution.SkipOnlyIfTaskExecuter.execute(SkipOnlyIfTaskExecuter.java:53) 06:05:09.114 [ERROR] [org.gradle.BuildExceptionReporter] at org.gradle.api.internal.tasks.execution.ExecuteAtMostOnceTaskExecuter.execute(ExecuteAtMostOnceTaskExecuter.java:43) 06:05:09.115 [ERROR] [org.gradle.BuildExceptionReporter] at org.gradle.api.internal.AbstractTask.executeWithoutThrowingTaskFailure(AbstractTask.java:289) 06:05:09.115 [ERROR] [org.gradle.BuildExceptionReporter] at org.gradle.execution.taskgraph.AbstractTaskPlanExecutor$TaskExecutorWorker.executeTask(AbstractTaskPlanExecutor.java:79) 06:05:09.115 [ERROR] [org.gradle.BuildExceptionReporter] at org.gradle.execution.taskgraph.AbstractTaskPlanExecutor$TaskExecutorWorker.processTask(AbstractTaskPlanExecutor.java:63) 06:05:09.115 [ERROR] [org.gradle.BuildExceptionReporter] at org.gradle.execution.taskgraph.AbstractTaskPlanExecutor$TaskExecutorWorker.run(AbstractTaskPlanExecutor.java:51) 06:05:09.115 [ERROR] [org.gradle.BuildExceptionReporter] at org.gradle.execution.taskgraph.DefaultTaskPlanExecutor$1.run(DefaultTaskPlanExecutor.java:33) 06:05:09.116 [ERROR] [org.gradle.BuildExceptionReporter] at org.gradle.internal.Factories$1.create(Factories.java:22) 06:05:09.116 [ERROR] [org.gradle.BuildExceptionReporter] at org.gradle.cache.internal.DefaultCacheAccess.longRunningOperation(DefaultCacheAccess.java:198) 06:05:09.116 [ERROR] [org.gradle.BuildExceptionReporter] at org.gradle.cache.internal.DefaultCacheAccess.longRunningOperation(DefaultCacheAccess.java:266) 06:05:09.116 [ERROR] [org.gradle.BuildExceptionReporter] at org.gradle.cache.internal.DefaultPersistentDirectoryStore.longRunningOperation(DefaultPersistentDirectoryStore.java:135) 06:05:09.116 [ERROR] [org.gradle.BuildExceptionReporter] at org.gradle.api.internal.changedetection.state.DefaultTaskArtifactStateCacheAccess.longRunningOperation(DefaultTaskArtifactStateCacheAccess.java:95) 06:05:09.117 [ERROR] [org.gradle.BuildExceptionReporter] at org.gradle.execution.taskgraph.DefaultTaskPlanExecutor.process(DefaultTaskPlanExecutor.java:31) 06:05:09.117 [ERROR] [org.gradle.BuildExceptionReporter] at org.gradle.execution.taskgraph.DefaultTaskGraphExecuter.execute(DefaultTaskGraphExecuter.java:86) 06:05:09.117 [ERROR] [org.gradle.BuildExceptionReporter] at org.gradle.execution.SelectedTaskExecutionAction.execute(SelectedTaskExecutionAction.java:29) 06:05:09.117 [ERROR] [org.gradle.BuildExceptionReporter] at org.gradle.execution.DefaultBuildExecuter.execute(DefaultBuildExecuter.java:61) 06:05:09.117 [ERROR] [org.gradle.BuildExceptionReporter] at org.gradle.execution.DefaultBuildExecuter.access$200(DefaultBuildExecuter.java:23) 06:05:09.118 [ERROR] [org.gradle.BuildExceptionReporter] at org.gradle.execution.DefaultBuildExecuter$2.proceed(DefaultBuildExecuter.java:67) 06:05:09.118 [ERROR] [org.gradle.BuildExceptionReporter] at org.gradle.execution.DryRunBuildExecutionAction.execute(DryRunBuildExecutionAction.java:32) 06:05:09.118 [ERROR] [org.gradle.BuildExceptionReporter] at org.gradle.execution.DefaultBuildExecuter.execute(DefaultBuildExecuter.java:61) 06:05:09.118 [ERROR] [org.gradle.BuildExceptionReporter] at org.gradle.execution.DefaultBuildExecuter.execute(DefaultBuildExecuter.java:54) 06:05:09.118 [ERROR] [org.gradle.BuildExceptionReporter] at org.gradle.initialization.DefaultGradleLauncher.doBuildStages(DefaultGradleLauncher.java:166) 06:05:09.119 [ERROR] [org.gradle.BuildExceptionReporter] at org.gradle.initialization.DefaultGradleLauncher.doBuild(DefaultGradleLauncher.java:113) 06:05:09.119 [ERROR] [org.gradle.BuildExceptionReporter] at org.gradle.initialization.DefaultGradleLauncher.run(DefaultGradleLauncher.java:81) 06:05:09.119 [ERROR] [org.gradle.BuildExceptionReporter] at org.gradle.launcher.exec.InProcessBuildActionExecuter$DefaultBuildController.run(InProcessBuildActionExecuter.java:64) 06:05:09.119 [ERROR] [org.gradle.BuildExceptionReporter] at org.gradle.launcher.cli.ExecuteBuildAction.run(ExecuteBuildAction.java:33) 06:05:09.119 [ERROR] [org.gradle.BuildExceptionReporter] at org.gradle.launcher.cli.ExecuteBuildAction.run(ExecuteBuildAction.java:24) 06:05:09.120 [ERROR] [org.gradle.BuildExceptionReporter] at org.gradle.launcher.exec.InProcessBuildActionExecuter.execute(InProcessBuildActionExecuter.java:35) 06:05:09.151 [ERROR] [org.gradle.BuildExceptionReporter] at org.gradle.launcher.daemon.server.exec.ExecuteBuild.doBuild(ExecuteBuild.java:45) 06:05:09.152 [ERROR] [org.gradle.BuildExceptionReporter] at org.gradle.launcher.daemon.server.exec.BuildCommandOnly.execute(BuildCommandOnly.java:34) 06:05:09.152 [ERROR] [org.gradle.BuildExceptionReporter] at org.gradle.launcher.daemon.server.exec.DaemonCommandExecution.proceed(DaemonCommandExecution.java:125) 06:05:09.152 [ERROR] [org.gradle.BuildExceptionReporter] at org.gradle.launcher.daemon.server.exec.WatchForDisconnection.execute(WatchForDisconnection.java:42) 06:05:09.152 [ERROR] [org.gradle.BuildExceptionReporter] at org.gradle.launcher.daemon.server.exec.DaemonCommandExecution.proceed(DaemonCommandExecution.java:125) 06:05:09.152 [ERROR] [org.gradle.BuildExceptionReporter] at org.gradle.launcher.daemon.server.exec.ResetDeprecationLogger.execute(ResetDeprecationLogger.java:24) 06:05:09.153 [ERROR] [org.gradle.BuildExceptionReporter] at org.gradle.launcher.daemon.server.exec.DaemonCommandExecution.proceed(DaemonCommandExecution.java:125) 06:05:09.153 [ERROR] [org.gradle.BuildExceptionReporter] at org.gradle.launcher.daemon.server.exec.StartStopIfBuildAndStop.execute(StartStopIfBuildAndStop.java:33) 06:05:09.153 [ERROR] [org.gradle.BuildExceptionReporter] at org.gradle.launcher.daemon.server.exec.DaemonCommandExecution.proceed(DaemonCommandExecution.java:125) 06:05:09.153 [ERROR] [org.gradle.BuildExceptionReporter] at org.gradle.launcher.daemon.server.exec.ReturnResult.execute(ReturnResult.java:34) 06:05:09.153 [ERROR] [org.gradle.BuildExceptionReporter] at org.gradle.launcher.daemon.server.exec.DaemonCommandExecution.proceed(DaemonCommandExecution.java:125) 06:05:09.154 [ERROR] [org.gradle.BuildExceptionReporter] at org.gradle.launcher.daemon.server.exec.ForwardClientInput$2.call(ForwardClientInput.java:71) 06:05:09.154 [ERROR] [org.gradle.BuildExceptionReporter] at org.gradle.launcher.daemon.server.exec.ForwardClientInput$2.call(ForwardClientInput.java:69) 06:05:09.154 [ERROR] [org.gradle.BuildExceptionReporter] at org.gradle.util.Swapper.swap(Swapper.java:38) 06:05:09.154 [ERROR] [org.gradle.BuildExceptionReporter] at org.gradle.launcher.daemon.server.exec.ForwardClientInput.execute(ForwardClientInput.java:69) 06:05:09.154 [ERROR] [org.gradle.BuildExceptionReporter] at org.gradle.launcher.daemon.server.exec.DaemonCommandExecution.proceed(DaemonCommandExecution.java:125) 06:05:09.155 [ERROR] [org.gradle.BuildExceptionReporter] at org.gradle.launcher.daemon.server.exec.LogToClient.doBuild(LogToClient.java:60) 06:05:09.155 [ERROR] [org.gradle.BuildExceptionReporter] at org.gradle.launcher.daemon.server.exec.BuildCommandOnly.execute(BuildCommandOnly.java:34) 06:05:09.155 [ERROR] [org.gradle.BuildExceptionReporter] at org.gradle.launcher.daemon.server.exec.DaemonCommandExecution.proceed(DaemonCommandExecution.java:125) 06:05:09.155 [ERROR] [org.gradle.BuildExceptionReporter] at org.gradle.launcher.daemon.server.exec.EstablishBuildEnvironment.doBuild(EstablishBuildEnvironment.java:60) 06:05:09.265 [ERROR] [org.gradle.BuildExceptionReporter] at org.gradle.launcher.daemon.server.exec.BuildCommandOnly.execute(BuildCommandOnly.java:34) 06:05:09.265 [ERROR] [org.gradle.BuildExceptionReporter] at org.gradle.launcher.daemon.server.exec.DaemonCommandExecution.proceed(DaemonCommandExecution.java:125) 06:05:09.265 [ERROR] [org.gradle.BuildExceptionReporter] at org.gradle.launcher.daemon.server.exec.StartBuildOrRespondWithBusy$1.run(StartBuildOrRespondWithBusy.java:45) 06:05:09.266 [ERROR] [org.gradle.BuildExceptionReporter] at org.gradle.launcher.daemon.server.DaemonStateCoordinator.runCommand(DaemonStateCoordinator.java:186) 06:05:09.266 [ERROR] [org.gradle.BuildExceptionReporter] at org.gradle.launcher.daemon.server.exec.StartBuildOrRespondWithBusy.doBuild(StartBuildOrRespondWithBusy.java:49) 06:05:09.266 [ERROR] [org.gradle.BuildExceptionReporter] at org.gradle.launcher.daemon.server.exec.BuildCommandOnly.execute(BuildCommandOnly.java:34) 06:05:09.266 [ERROR] [org.gradle.BuildExceptionReporter] at org.gradle.launcher.daemon.server.exec.DaemonCommandExecution.proceed(DaemonCommandExecution.java:125) 06:05:09.267 [ERROR] [org.gradle.BuildExceptionReporter] at org.gradle.launcher.daemon.server.exec.HandleStop.execute(HandleStop.java:36) 06:05:09.267 [ERROR] [org.gradle.BuildExceptionReporter] at org.gradle.launcher.daemon.server.exec.DaemonCommandExecution.proceed(DaemonCommandExecution.java:125) 06:05:09.267 [ERROR] [org.gradle.BuildExceptionReporter] at org.gradle.launcher.daemon.server.exec.DaemonHygieneAction.execute(DaemonHygieneAction.java:39) 06:05:09.267 [ERROR] [org.gradle.BuildExceptionReporter] at org.gradle.launcher.daemon.server.exec.DaemonCommandExecution.proceed(DaemonCommandExecution.java:125) 06:05:09.267 [ERROR] [org.gradle.BuildExceptionReporter] at org.gradle.launcher.daemon.server.exec.CatchAndForwardDaemonFailure.execute(CatchAndForwardDaemonFailure.java:32) 06:05:09.268 [ERROR] [org.gradle.BuildExceptionReporter] at org.gradle.launcher.daemon.server.exec.DaemonCommandExecution.proceed(DaemonCommandExecution.java:125) 06:05:09.268 [ERROR] [org.gradle.BuildExceptionReporter] at org.gradle.launcher.daemon.server.exec.DefaultDaemonCommandExecuter.executeCommand(DefaultDaemonCommandExecuter.java:51) 06:05:09.268 [ERROR] [org.gradle.BuildExceptionReporter] at org.gradle.launcher.daemon.server.DefaultIncomingConnectionHandler$ConnectionWorker.handleCommand(DefaultIncomingConnectionHandler.java:155) 06:05:09.268 [ERROR] [org.gradle.BuildExceptionReporter] at org.gradle.launcher.daemon.server.DefaultIncomingConnectionHandler$ConnectionWorker.receiveAndHandleCommand(DefaultIncomingConnectionHandler.java:128) 06:05:09.268 [ERROR] [org.gradle.BuildExceptionReporter] at org.gradle.launcher.daemon.server.DefaultIncomingConnectionHandler$ConnectionWorker.run(DefaultIncomingConnectionHandler.java:116) 06:05:09.269 [ERROR] [org.gradle.BuildExceptionReporter] at org.gradle.internal.concurrent.DefaultExecutorFactory$StoppableExecutorImpl$1.run(DefaultExecutorFactory.java:64) 06:05:09.269 [ERROR] [org.gradle.BuildExceptionReporter] Caused by: org.gradle.api.internal.artifacts.ivyservice.ModuleVersionResolveException: Could not resolve xbean" name:naming" rev: fo. 06:05:09.269 [ERROR] [org.gradle.BuildExceptionReporter] Required by: 06:05:09.269 [ERROR] [org.gradle.BuildExceptionReporter]

net.therap:admin2:2014.0.0-SNAPSHOT > net.therap:test-util:2014.0.0-SNAPSHOT > org.apache.openejb:openejb-core:4.6.0 06:05:09.269 [ERROR] [org.gradle.BuildExceptionReporter] at org.gradle.api.internal.artifacts.ivyservice.ivyresolve.UserResolverChain.resolve(UserResolverChain.java:67) 06:05:09.270 [ERROR] [org.gradle.BuildExceptionReporter] at org.gradle.api.internal.artifacts.ivyservice.clientmodule.ClientModuleResolver.resolve(ClientModuleResolver.java:34) 06:05:09.270 [ERROR] [org.gradle.BuildExceptionReporter] at org.gradle.api.internal.artifacts.ivyservice.projectmodule.ProjectDependencyResolver.resolve(ProjectDependencyResolver.java:48) 06:05:09.270 [ERROR] [org.gradle.BuildExceptionReporter] at org.gradle.api.internal.artifacts.ivyservice.ivyresolve.LazyDependencyToModuleResolver$AbstractVersionResolveResult.resolve(LazyDependencyToModuleResolver.java:86) 06:05:09.270 [ERROR] [org.gradle.BuildExceptionReporter] at org.gradle.api.internal.artifacts.ivyservice.resolveengine.DependencyGraphBuilder$ModuleVersionResolveState.resolve(DependencyGraphBuilder.java:649) 06:05:09.270 [ERROR] [org.gradle.BuildExceptionReporter] at org.gradle.api.internal.artifacts.ivyservice.resolveengine.DependencyGraphBuilder$ModuleVersionResolveState.getMetaData(DependencyGraphBuilder.java:660) 06:05:09.270 [ERROR] [org.gradle.BuildExceptionReporter] at org.gradle.api.internal.artifacts.ivyservice.resolveengine.DependencyGraphBuilder$DependencyEdge.calculateTargetConfigurations(DependencyGraphBuilder.java:336) 06:05:09.271 [ERROR] [org.gradle.BuildExceptionReporter] at org.gradle.api.internal.artifacts.ivyservice.resolveengine.DependencyGraphBuilder$DependencyEdge.attachToTargetConfigurations(DependencyGraphBuilder.java:310) 06:05:09.271 [ERROR] [org.gradle.BuildExceptionReporter] at org.gradle.api.internal.artifacts.ivyservice.resolveengine.DependencyGraphBuilder.traverseGraph(DependencyGraphBuilder.java:126) 06:05:09.271 [ERROR] [org.gradle.BuildExceptionReporter] at org.gradle.api.internal.artifacts.ivyservice.resolveengine.DependencyGraphBuilder.resolve(DependencyGraphBuilder.java:66) 06:05:09.271 [ERROR] [org.gradle.BuildExceptionReporter] at org.gradle.api.internal.artifacts.ivyservice.resolveengine.DefaultDependencyResolver$1.transform(DefaultDependencyResolver.java:108) 06:05:09.271 [ERROR] [org.gradle.BuildExceptionReporter] at org.gradle.api.internal.artifacts.ivyservice.resolveengine.DefaultDependencyResolver$1.transform(DefaultDependencyResolver.java:77) 06:05:09.272 [ERROR] [org.gradle.BuildExceptionReporter] at org.gradle.api.internal.artifacts.ivyservice.DefaultIvyContextManager.withIvy(DefaultIvyContextManager.java:61) 06:05:09.272 [ERROR] [org.gradle.BuildExceptionReporter] at org.gradle.api.internal.artifacts.ivyservice.resolveengine.DefaultDependencyResolver.resolve(DefaultDependencyResolver.java:77) 06:05:09.272 [ERROR] [org.gradle.BuildExceptionReporter] at org.gradle.api.internal.artifacts.ivyservice.CacheLockingArtifactDependencyResolver$1.create(CacheLockingArtifactDependencyResolver.java:39) 06:05:09.303 [ERROR] [org.gradle.BuildExceptionReporter] at org.gradle.api.internal.artifacts.ivyservice.CacheLockingArtifactDependencyResolver$1.create(CacheLockingArtifactDependencyResolver.java:37) 06:05:09.304 [ERROR] [org.gradle.BuildExceptionReporter] at org.gradle.cache.internal.DefaultCacheAccess.useCache(DefaultCacheAccess.java:148) 06:05:09.304 [ERROR] [org.gradle.BuildExceptionReporter] at org.gradle.cache.internal.DefaultPersistentDirectoryStore.useCache(DefaultPersistentDirectoryStore.java:123) 06:05:09.304 [ERROR] [org.gradle.BuildExceptionReporter] at org.gradle.api.internal.artifacts.ivyservice.DefaultCacheLockingManager.useCache(DefaultCacheLockingManager.java:77) 06:05:09.304 [ERROR] [org.gradle.BuildExceptionReporter] at org.gradle.api.internal.artifacts.ivyservice.CacheLockingArtifactDependencyResolver.resolve(CacheLockingArtifactDependencyResolver.java:37) 06:05:09.304 [ERROR] [org.gradle.BuildExceptionReporter] at org.gradle.api.internal.artifacts.ivyservice.SelfResolvingDependencyResolver.resolve(SelfResolvingDependencyResolver.java:41) 06:05:09.305 [ERROR] [org.gradle.BuildExceptionReporter] at org.gradle.api.internal.artifacts.ivyservice.ShortcircuitEmptyConfigsArtifactDependencyResolver.resolve(ShortcircuitEmptyConfigsArtifactDependencyResolver.java:46) 06:05:09.305 [ERROR] [org.gradle.BuildExceptionReporter] at org.gradle.api.internal.artifacts.ivyservice.ErrorHandlingArtifactDependencyResolver.resolve(ErrorHandlingArtifactDependencyResolver.java:44) 06:05:09.305 [ERROR] [org.gradle.BuildExceptionReporter] at org.gradle.api.internal.artifacts.ivyservice.DefaultConfigurationResolver.resolve(DefaultConfigurationResolver.java:42) 06:05:09.305 [ERROR] [org.gradle.BuildExceptionReporter] at org.gradle.api.internal.artifacts.configurations.DefaultConfiguration.resolveNow(DefaultConfiguration.java:240) 06:05:09.305 [ERROR] [org.gradle.BuildExceptionReporter] at org.gradle.api.internal.artifacts.configurations.DefaultConfiguration.getResolvedConfiguration(DefaultConfiguration.java:230) 06:05:09.306 [ERROR] [org.gradle.BuildExceptionReporter] at org.gradle.api.internal.artifacts.configurations.DefaultConfiguration_Decorated.getResolvedConfiguration(Unknown Source) 06:05:09.306 [ERROR] [org.gradle.BuildExceptionReporter] at org.gradle.api.internal.artifacts.configurations.DefaultConfiguration$ConfigurationFileCollection.getFiles(DefaultConfiguration.java:463) 06:05:09.306 [ERROR] [org.gradle.BuildExceptionReporter] … 90 more 06:05:09.306 [ERROR] [org.gradle.BuildExceptionReporter] Caused by: java.lang.IllegalArgumentException 06:05:09.306 [ERROR] [org.gradle.BuildExceptionReporter] at org.apache.http.client.methods.HttpGet.(HttpGet.java:69) 06:05:09.307 [ERROR] [org.gradle.BuildExceptionReporter] at org.gradle.api.internal.externalresource.transport.http.HttpClientHelper.performRawGet(HttpClientHelper.java:66) 06:05:09.307 [ERROR] [org.gradle.BuildExceptionReporter] at org.gradle.api.internal.externalresource.transport.http.HttpClientHelper.performGet(HttpClientHelper.java:70) 06:05:09.307 [ERROR] [org.gradle.BuildExceptionReporter] at org.gradle.api.internal.externalresource.transport.http.HttpResourceAccessor.getResource(HttpResourceAccessor.java:46) 06:05:09.307 [ERROR] [org.gradle.BuildExceptionReporter] at org.gradle.api.internal.externalresource.transport.http.HttpResourceAccessor.getResource(HttpResourceAccessor.java:32) 06:05:09.440 [ERROR] [org.gradle.BuildExceptionReporter] at org.gradle.api.internal.externalresource.transfer.ProgressLoggingExternalResourceAccessor.getResource(ProgressLoggingExternalResourceAccessor.java:38) 06:05:09.440 [ERROR] [org.gradle.BuildExceptionReporter] at org.gradle.api.internal.externalresource.transfer.DefaultCacheAwareExternalResourceAccessor.getResource(DefaultCacheAwareExternalResourceAccessor.java:60) 06:05:09.440 [ERROR] [org.gradle.BuildExceptionReporter] at org.gradle.api.internal.externalresource.transport.DefaultExternalResourceRepository.getResource(DefaultExternalResourceRepository.java:65) 06:05:09.440 [ERROR] [org.gradle.BuildExceptionReporter] at org.gradle.api.internal.artifacts.repositories.resolver.ExternalResourceResolver.getResource(ExternalResourceResolver.java:427) 06:05:09.440 [ERROR] [org.gradle.BuildExceptionReporter] at org.gradle.api.internal.artifacts.repositories.resolver.ExternalResourceResolver.findStaticResourceUsingPatterns(ExternalResourceResolver.java:307) 06:05:09.441 [ERROR] [org.gradle.BuildExceptionReporter] at org.gradle.api.internal.artifacts.repositories.resolver.ExternalResourceResolver.findMetaDataFileUsingAnyPattern(ExternalResourceResolver.java:266) 06:05:09.441 [ERROR] [org.gradle.BuildExceptionReporter] at org.gradle.api.internal.artifacts.repositories.resolver.ExternalResourceResolver.findStaticDependency(ExternalResourceResolver.java:170) 06:05:09.441 [ERROR] [org.gradle.BuildExceptionReporter] at org.gradle.api.internal.artifacts.repositories.resolver.ExternalResourceResolver.getDependency(ExternalResourceResolver.java:165) 06:05:09.441 [ERROR] [org.gradle.BuildExceptionReporter] at org.gradle.api.internal.artifacts.repositories.resolver.MavenResolver.getDependency(MavenResolver.java:81) 06:05:09.441 [ERROR] [org.gradle.BuildExceptionReporter] at org.gradle.api.internal.artifacts.repositories.resolver.ExternalResourceResolver.getDependency(ExternalResourceResolver.java:157) 06:05:09.442 [ERROR] [org.gradle.BuildExceptionReporter] at org.gradle.api.internal.artifacts.ivyservice.ivyresolve.CacheLockingModuleVersionRepository$1.run(CacheLockingModuleVersionRepository.java:46) 06:05:09.442 [ERROR] [org.gradle.BuildExceptionReporter] at org.gradle.internal.Factories$1.create(Factories.java:22) 06:05:09.442 [ERROR] [org.gradle.BuildExceptionReporter] at org.gradle.cache.internal.DefaultCacheAccess.longRunningOperation(DefaultCacheAccess.java:198) 06:05:09.442 [ERROR] [org.gradle.BuildExceptionReporter] at org.gradle.cache.internal.DefaultCacheAccess.longRunningOperation(DefaultCacheAccess.java:266) 06:05:09.442 [ERROR] [org.gradle.BuildExceptionReporter] at org.gradle.cache.internal.DefaultPersistentDirectoryStore.longRunningOperation(DefaultPersistentDirectoryStore.java:135) 06:05:09.443 [ERROR] [org.gradle.BuildExceptionReporter] at org.gradle.api.internal.artifacts.ivyservice.DefaultCacheLockingManager.longRunningOperation(DefaultCacheLockingManager.java:73) 06:05:09.443 [ERROR] [org.gradle.BuildExceptionReporter] at org.gradle.api.internal.artifacts.ivyservice.ivyresolve.CacheLockingModuleVersionRepository.getDependency(CacheLockingModuleVersionRepository.java:44) 06:05:09.443 [ERROR] [org.gradle.BuildExceptionReporter] at org.gradle.api.internal.artifacts.ivyservice.ivyresolve.CachingModuleVersionRepository.getDependency(CachingModuleVersionRepository.java:90) 06:05:09.443 [ERROR] [org.gradle.BuildExceptionReporter] at org.gradle.api.internal.artifacts.ivyservice.ivyresolve.memcache.CachedRepository.getDependency(CachedRepository.java:55) 06:05:09.443 [ERROR] [org.gradle.BuildExceptionReporter] at org.gradle.api.internal.artifacts.ivyservice.ivyresolve.UserResolverChain$RepositoryResolveState.resolve(UserResolverChain.java:184) 06:05:09.444 [ERROR] [org.gradle.BuildExceptionReporter] at org.gradle.api.internal.artifacts.ivyservice.ivyresolve.UserResolverChain.findLatestModule(UserResolverChain.java:98) 06:05:09.444 [ERROR] [org.gradle.BuildExceptionReporter] at org.gradle.api.internal.artifacts.ivyservice.ivyresolve.UserResolverChain.findLatestModule(UserResolverChain.java:81) 06:05:09.444 [ERROR] [org.gradle.BuildExceptionReporter] at org.gradle.api.internal.artifacts.ivyservice.ivyresolve.UserResolverChain.resolve(UserResolverChain.java:56) 06:05:09.444 [ERROR] [org.gradle.BuildExceptionReporter] … 117 more 06:05:09.444 [ERROR] [org.gradle.BuildExceptionReporter] Caused by: java.net.URISyntaxException: Illegal character in path at index 63: http://artifactory.therapbd.net//artifactory/libs-release/xbean" name/naming" rev/ fo/naming" rev- fo.pom 06:05:09.445 [ERROR] [org.gradle.BuildExceptionReporter] … 145 more


(Szczepan Faber) #2

I think it’s this issue: http://issues.gradle.org/browse/GRADLE-2987 We want to fix it in Gradle 1.11