Dependency corruption in 1.10


(Corneil du Plessis) #1

We have a large project with Maven and Ivy dependencies. After upgrading to version 1.10 we encountered:

-------------------------------------------- Execution failed for task ‘:web:cacApp:createExternalWeb’. > Could not resolve all dependencies for configuration ‘:web:cacApp:webPackages’.

Could not resolve -DEVELOPMENT-SNAP:rce=“true” conf="compile->com:,master(*);runtime->runt.

Required by:

FAW.web:cacApp:LATEST-DEVELOPMENT-SNAPSHOT > FAW.web.functions:web.functions.onlineQuote:LATEST-DEVELOPMENT-SNAPSHOT

java.lang.IllegalArgumentException (no error message)

Could not resolve rev=“LATEST-:ENT-SNAPSHOT” force=:LATEST-DEVELOPMENT-SNAPSHOT.

Required by:

FAW.web:cacApp:LATEST-DEVELOPMENT-SNAPSHOT > FAW.web.functions:web.functions.workflowFunctions:LATEST-DEVELOPMENT-SNAPSHOT

Unable to load Maven meta-data from http://fawbuilder.momentum.co.za/repo/ rev=“LATEST-/ENT-SNAPSHOT” force=/LATEST-DEVELOPMENT-SNAPSHOT/maven-metadata.xml.

java.lang.IllegalArgumentException (no error message)

Could not resolve org=“3rdparty” n:l.jakartaOro" rev:" force=“true” conf="compil.

Required by:

FAW.web:cacApp:LATEST-DEVELOPMENT-SNAPSHOT > FAW.web.functions:web.functions.workflowFunctions:LATEST-DEVELOPMENT-SNAPSHOT

java.lang.IllegalArgumentException (no error message) --------------------------------------------

I have not been able to narrow down the specific reason but going back to 1.9 resolves the issue. I will try and determine when the dependencies get corrupted somehow.

Stack trace:

10:31:18.581 [ERROR] [org.gradle.BuildExceptionReporter]

10:31:18.581 [ERROR] [org.gradle.BuildExceptionReporter] FAILURE: Build failed with an exception. 10:31:18.581 [ERROR] [org.gradle.BuildExceptionReporter]

10:31:18.582 [ERROR] [org.gradle.BuildExceptionReporter] * Where: 10:31:18.582 [ERROR] [org.gradle.BuildExceptionReporter] Script ‘/home/corneil/eaf/environment/development/develop/tools/gradle/web-local.gradle’ line: 454 10:31:18.582 [ERROR] [org.gradle.BuildExceptionReporter]

10:31:18.582 [ERROR] [org.gradle.BuildExceptionReporter] * What went wrong: 10:31:18.582 [ERROR] [org.gradle.BuildExceptionReporter] Execution failed for task ‘:web:cacApp:createExternalWeb’. 10:31:18.582 [ERROR] [org.gradle.BuildExceptionReporter] > Could not resolve all dependencies for configuration ‘:web:cacApp:webPackages’. 10:31:18.582 [ERROR] [org.gradle.BuildExceptionReporter]

Could not resolve -DEVELOPMENT-SNAP:rce=“true” conf="compile->com:,master(*);runtime->runt. 10:31:18.582 [ERROR] [org.gradle.BuildExceptionReporter]

Required by: 10:31:18.582 [ERROR] [org.gradle.BuildExceptionReporter]

FAW.web:cacApp:LATEST-DEVELOPMENT-SNAPSHOT > FAW.web.functions:web.functions.onlineQuote:LATEST-DEVELOPMENT-SNAPSHOT 10:31:18.582 [ERROR] [org.gradle.BuildExceptionReporter]

java.lang.IllegalArgumentException (no error message) 10:31:18.582 [ERROR] [org.gradle.BuildExceptionReporter]

Could not resolve rev=“LATEST-:ENT-SNAPSHOT” force=:LATEST-DEVELOPMENT-SNAPSHOT. 10:31:18.582 [ERROR] [org.gradle.BuildExceptionReporter]

Required by: 10:31:18.582 [ERROR] [org.gradle.BuildExceptionReporter]

FAW.web:cacApp:LATEST-DEVELOPMENT-SNAPSHOT > FAW.web.functions:web.functions.workflowFunctions:LATEST-DEVELOPMENT-SNAPSHOT 10:31:18.583 [ERROR] [org.gradle.BuildExceptionReporter]

Unable to load Maven meta-data from http://fawbuilder.momentum.co.za/repo/ rev=“LATEST-/ENT-SNAPSHOT” force=/LATEST-DEVELOPMENT-SNAPSHOT/maven-metadata.xml. 10:31:18.583 [ERROR] [org.gradle.BuildExceptionReporter]

java.lang.IllegalArgumentException (no error message) 10:31:18.583 [ERROR] [org.gradle.BuildExceptionReporter]

Could not resolve org=“3rdparty” n:l.jakartaOro" rev:" force=“true” conf="compil. 10:31:18.583 [ERROR] [org.gradle.BuildExceptionReporter]

Required by: 10:31:18.583 [ERROR] [org.gradle.BuildExceptionReporter]

FAW.web:cacApp:LATEST-DEVELOPMENT-SNAPSHOT > FAW.web.functions:web.functions.workflowFunctions:LATEST-DEVELOPMENT-SNAPSHOT 10:31:18.583 [ERROR] [org.gradle.BuildExceptionReporter]

java.lang.IllegalArgumentException (no error message) 10:31:18.583 [ERROR] [org.gradle.BuildExceptionReporter]

10:31:18.583 [ERROR] [org.gradle.BuildExceptionReporter] * Exception is: 10:31:18.584 [ERROR] [org.gradle.BuildExceptionReporter] org.gradle.api.tasks.TaskExecutionException: Execution failed for task ‘:web:cacApp:createExternalWeb’. 10:31:18.584 [ERROR] [org.gradle.BuildExceptionReporter] at org.gradle.api.internal.tasks.execution.ExecuteActionsTaskExecuter.executeActions(ExecuteActionsTaskExecuter.java:69) 10:31:18.584 [ERROR] [org.gradle.BuildExceptionReporter] at org.gradle.api.internal.tasks.execution.ExecuteActionsTaskExecuter.execute(ExecuteActionsTaskExecuter.java:46) 10:31:18.584 [ERROR] [org.gradle.BuildExceptionReporter] at org.gradle.api.internal.tasks.execution.PostExecutionAnalysisTaskExecuter.execute(PostExecutionAnalysisTaskExecuter.java:35) 10:31:18.584 [ERROR] [org.gradle.BuildExceptionReporter] at org.gradle.api.internal.tasks.execution.SkipUpToDateTaskExecuter.execute(SkipUpToDateTaskExecuter.java:64) 10:31:18.584 [ERROR] [org.gradle.BuildExceptionReporter] at org.gradle.api.internal.tasks.execution.ValidatingTaskExecuter.execute(ValidatingTaskExecuter.java:58) 10:31:18.584 [ERROR] [org.gradle.BuildExceptionReporter] at org.gradle.api.internal.tasks.execution.SkipEmptySourceFilesTaskExecuter.execute(SkipEmptySourceFilesTaskExecuter.java:42) 10:31:18.584 [ERROR] [org.gradle.BuildExceptionReporter] at org.gradle.api.internal.tasks.execution.SkipTaskWithNoActionsExecuter.execute(SkipTaskWithNoActionsExecuter.java:52) 10:31:18.584 [ERROR] [org.gradle.BuildExceptionReporter] at org.gradle.api.internal.tasks.execution.SkipOnlyIfTaskExecuter.execute(SkipOnlyIfTaskExecuter.java:53) 10:31:18.584 [ERROR] [org.gradle.BuildExceptionReporter] at org.gradle.api.internal.tasks.execution.ExecuteAtMostOnceTaskExecuter.execute(ExecuteAtMostOnceTaskExecuter.java:43) 10:31:18.585 [ERROR] [org.gradle.BuildExceptionReporter] at org.gradle.api.internal.AbstractTask.executeWithoutThrowingTaskFailure(AbstractTask.java:289) 10:31:18.585 [ERROR] [org.gradle.BuildExceptionReporter] at org.gradle.execution.taskgraph.AbstractTaskPlanExecutor$TaskExecutorWorker.executeTask(AbstractTaskPlanExecutor.java:79) 10:31:18.585 [ERROR] [org.gradle.BuildExceptionReporter] at org.gradle.execution.taskgraph.AbstractTaskPlanExecutor$TaskExecutorWorker.processTask(AbstractTaskPlanExecutor.java:63) 10:31:18.585 [ERROR] [org.gradle.BuildExceptionReporter] at org.gradle.execution.taskgraph.AbstractTaskPlanExecutor$TaskExecutorWorker.run(AbstractTaskPlanExecutor.java:51) 10:31:18.585 [ERROR] [org.gradle.BuildExceptionReporter] at org.gradle.execution.taskgraph.DefaultTaskPlanExecutor$1.run(DefaultTaskPlanExecutor.java:33) 10:31:18.585 [ERROR] [org.gradle.BuildExceptionReporter] at org.gradle.internal.Factories$1.create(Factories.java:22) 10:31:18.585 [ERROR] [org.gradle.BuildExceptionReporter] at org.gradle.cache.internal.DefaultCacheAccess.longRunningOperation(DefaultCacheAccess.java:198) 10:31:18.585 [ERROR] [org.gradle.BuildExceptionReporter] at org.gradle.cache.internal.DefaultCacheAccess.longRunningOperation(DefaultCacheAccess.java:266) 10:31:18.585 [ERROR] [org.gradle.BuildExceptionReporter] at org.gradle.cache.internal.DefaultPersistentDirectoryStore.longRunningOperation(DefaultPersistentDirectoryStore.java:135) 10:31:18.585 [ERROR] [org.gradle.BuildExceptionReporter] at org.gradle.api.internal.changedetection.state.DefaultTaskArtifactStateCacheAccess.longRunningOperation(DefaultTaskArtifactStateCacheAccess.java:95) 10:31:18.585 [ERROR] [org.gradle.BuildExceptionReporter] at org.gradle.execution.taskgraph.DefaultTaskPlanExecutor.process(DefaultTaskPlanExecutor.java:31) 10:31:18.585 [ERROR] [org.gradle.BuildExceptionReporter] at org.gradle.execution.taskgraph.DefaultTaskGraphExecuter.execute(DefaultTaskGraphExecuter.java:86) 10:31:18.585 [ERROR] [org.gradle.BuildExceptionReporter] at org.gradle.execution.SelectedTaskExecutionAction.execute(SelectedTaskExecutionAction.java:29) 10:31:18.585 [ERROR] [org.gradle.BuildExceptionReporter] at org.gradle.execution.DefaultBuildExecuter.execute(DefaultBuildExecuter.java:61) 10:31:18.585 [ERROR] [org.gradle.BuildExceptionReporter] at org.gradle.execution.DefaultBuildExecuter.access$200(DefaultBuildExecuter.java:23) 10:31:18.585 [ERROR] [org.gradle.BuildExceptionReporter] at org.gradle.execution.DefaultBuildExecuter$2.proceed(DefaultBuildExecuter.java:67) 10:31:18.586 [ERROR] [org.gradle.BuildExceptionReporter] at org.gradle.execution.DryRunBuildExecutionAction.execute(DryRunBuildExecutionAction.java:32) 10:31:18.586 [ERROR] [org.gradle.BuildExceptionReporter] at org.gradle.execution.DefaultBuildExecuter.execute(DefaultBuildExecuter.java:61) 10:31:18.586 [ERROR] [org.gradle.BuildExceptionReporter] at org.gradle.execution.DefaultBuildExecuter.execute(DefaultBuildExecuter.java:54) 10:31:18.586 [ERROR] [org.gradle.BuildExceptionReporter] at org.gradle.initialization.DefaultGradleLauncher.doBuildStages(DefaultGradleLauncher.java:166) 10:31:18.586 [ERROR] [org.gradle.BuildExceptionReporter] at org.gradle.initialization.DefaultGradleLauncher.doBuild(DefaultGradleLauncher.java:113) 10:31:18.586 [ERROR] [org.gradle.BuildExceptionReporter] at org.gradle.initialization.DefaultGradleLauncher.run(DefaultGradleLauncher.java:81) 10:31:18.586 [ERROR] [org.gradle.BuildExceptionReporter] at org.gradle.launcher.exec.InProcessBuildActionExecuter$DefaultBuildController.run(InProcessBuildActionExecuter.java:64) 10:31:18.586 [ERROR] [org.gradle.BuildExceptionReporter] at org.gradle.launcher.cli.ExecuteBuildAction.run(ExecuteBuildAction.java:33) 10:31:18.586 [ERROR] [org.gradle.BuildExceptionReporter] at org.gradle.launcher.cli.ExecuteBuildAction.run(ExecuteBuildAction.java:24) 10:31:18.586 [ERROR] [org.gradle.BuildExceptionReporter] at org.gradle.launcher.exec.InProcessBuildActionExecuter.execute(InProcessBuildActionExecuter.java:35) 10:31:18.586 [ERROR] [org.gradle.BuildExceptionReporter] at org.gradle.launcher.exec.InProcessBuildActionExecuter.execute(InProcessBuildActionExecuter.java:26) 10:31:18.586 [ERROR] [org.gradle.BuildExceptionReporter] at org.gradle.launcher.cli.RunBuildAction.run(RunBuildAction.java:50) 10:31:18.586 [ERROR] [org.gradle.BuildExceptionReporter] at org.gradle.internal.Actions$RunnableActionAdapter.execute(Actions.java:171) 10:31:18.586 [ERROR] [org.gradle.BuildExceptionReporter] at org.gradle.launcher.cli.CommandLineActionFactory$ParseAndBuildAction.execute(CommandLineActionFactory.java:201) 10:31:18.586 [ERROR] [org.gradle.BuildExceptionReporter] at org.gradle.launcher.cli.CommandLineActionFactory$ParseAndBuildAction.execute(CommandLineActionFactory.java:174) 10:31:18.587 [ERROR] [org.gradle.BuildExceptionReporter] at org.gradle.launcher.cli.CommandLineActionFactory$WithLogging.execute(CommandLineActionFactory.java:170) 10:31:18.587 [ERROR] [org.gradle.BuildExceptionReporter] at org.gradle.launcher.cli.CommandLineActionFactory$WithLogging.execute(CommandLineActionFactory.java:139) 10:31:18.587 [ERROR] [org.gradle.BuildExceptionReporter] at org.gradle.launcher.cli.ExceptionReportingAction.execute(ExceptionReportingAction.java:33) 10:31:18.587 [ERROR] [org.gradle.BuildExceptionReporter] at org.gradle.launcher.cli.ExceptionReportingAction.execute(ExceptionReportingAction.java:22) 10:31:18.587 [ERROR] [org.gradle.BuildExceptionReporter] at org.gradle.launcher.Main.doAction(Main.java:46) 10:31:18.587 [ERROR] [org.gradle.BuildExceptionReporter] at org.gradle.launcher.bootstrap.EntryPoint.run(EntryPoint.java:45) 10:31:18.587 [ERROR] [org.gradle.BuildExceptionReporter] at org.gradle.launcher.Main.main(Main.java:37) 10:31:18.587 [ERROR] [org.gradle.BuildExceptionReporter] at sun.reflect.NativeMethodAccessorImpl.invoke0(Native Method) 10:31:18.587 [ERROR] [org.gradle.BuildExceptionReporter] at sun.reflect.NativeMethodAccessorImpl.invoke(NativeMethodAccessorImpl.java:39) 10:31:18.587 [ERROR] [org.gradle.BuildExceptionReporter] at sun.reflect.DelegatingMethodAccessorImpl.invoke(DelegatingMethodAccessorImpl.java:25) 10:31:18.587 [ERROR] [org.gradle.BuildExceptionReporter] at java.lang.reflect.Method.invoke(Method.java:597) 10:31:18.587 [ERROR] [org.gradle.BuildExceptionReporter] at org.gradle.launcher.bootstrap.ProcessBootstrap.runNoExit(ProcessBootstrap.java:50) 10:31:18.587 [ERROR] [org.gradle.BuildExceptionReporter] at org.gradle.launcher.bootstrap.ProcessBootstrap.run(ProcessBootstrap.java:32) 10:31:18.587 [ERROR] [org.gradle.BuildExceptionReporter] at org.gradle.launcher.GradleMain.main(GradleMain.java:23) 10:31:18.587 [ERROR] [org.gradle.BuildExceptionReporter] Caused by: org.gradle.api.artifacts.ResolveException: Could not resolve all dependencies for configuration ‘:web:cacApp:webPackages’. 10:31:18.587 [ERROR] [org.gradle.BuildExceptionReporter] at org.gradle.api.internal.artifacts.ivyservice.DefaultLenientConfiguration.rethrowFailure(DefaultLenientConfiguration.java:52) 10:31:18.587 [ERROR] [org.gradle.BuildExceptionReporter] at org.gradle.api.internal.artifacts.ivyservice.DefaultResolvedConfiguration.rethrowFailure(DefaultResolvedConfiguration.java:36) 10:31:18.588 [ERROR] [org.gradle.BuildExceptionReporter] at org.gradle.api.internal.artifacts.ivyservice.DefaultResolvedConfiguration.getFirstLevelModuleDependencies(DefaultResolvedConfiguration.java:49) 10:31:18.588 [ERROR] [org.gradle.BuildExceptionReporter] at org.gradle.api.internal.artifacts.ivyservice.SelfResolvingDependencyResolver$FilesAggregatingResolvedConfiguration.getFirstLevelModuleDependencies(SelfResolvingDependencyResolver.java:90) 10:31:18.588 [ERROR] [org.gradle.BuildExceptionReporter] at org.gradle.api.internal.artifacts.ivyservice.ErrorHandlingArtifactDependencyResolver$ErrorHandlingResolvedConfiguration.getFirstLevelModuleDependencies(ErrorHandlingArtifactDependencyResolver.java:192) 10:31:18.588 [ERROR] [org.gradle.BuildExceptionReporter] at sun.reflect.NativeMethodAccessorImpl.invoke0(Native Method) 10:31:18.588 [ERROR] [org.gradle.BuildExceptionReporter] at sun.reflect.NativeMethodAccessorImpl.invoke(NativeMethodAccessorImpl.java:39) 10:31:18.588 [ERROR] [org.gradle.BuildExceptionReporter] at sun.reflect.DelegatingMethodAccessorImpl.invoke(DelegatingMethodAccessorImpl.java:25) 10:31:18.588 [ERROR] [org.gradle.BuildExceptionReporter] at java.lang.reflect.Method.invoke(Method.java:597) 10:31:18.588 [ERROR] [org.gradle.BuildExceptionReporter] at org.codehaus.groovy.reflection.CachedMethod.invoke(CachedMethod.java:90) 10:31:18.588 [ERROR] [org.gradle.BuildExceptionReporter] at groovy.lang.MetaMethod.doMethodInvoke(MetaMethod.java:233) 10:31:18.588 [ERROR] [org.gradle.BuildExceptionReporter] at groovy.lang.MetaClassImpl$GetBeanMethodMetaProperty.getProperty(MetaClassImpl.java:3465) 10:31:18.588 [ERROR] [org.gradle.BuildExceptionReporter] at org.codehaus.groovy.runtime.callsite.GetEffectivePojoPropertySite.getProperty(GetEffectivePojoPropertySite.java:61) 10:31:18.588 [ERROR] [org.gradle.BuildExceptionReporter] at org.codehaus.groovy.runtime.callsite.AbstractCallSite.callGetProperty(AbstractCallSite.java:227) 10:31:18.588 [ERROR] [org.gradle.BuildExceptionReporter] at web_local_5tppvem9btsabge7pba8iqg6ao$_run_closure7_closure51.doCall(/home/corneil/eaf/environment/development/develop/tools/gradle/web-local.gradle:454) 10:31:18.588 [ERROR] [org.gradle.BuildExceptionReporter] at sun.reflect.NativeMethodAccessorImpl.invoke0(Native Method) 10:31:18.588 [ERROR] [org.gradle.BuildExceptionReporter] at sun.reflect.NativeMethodAccessorImpl.invoke(NativeMethodAccessorImpl.java:39) 10:31:18.588 [ERROR] [org.gradle.BuildExceptionReporter] at sun.reflect.DelegatingMethodAccessorImpl.invoke(DelegatingMethodAccessorImpl.java:25) 10:31:18.588 [ERROR] [org.gradle.BuildExceptionReporter] at java.lang.reflect.Method.invoke(Method.java:597) 10:31:18.588 [ERROR] [org.gradle.BuildExceptionReporter] at org.codehaus.groovy.reflection.CachedMethod.invoke(CachedMethod.java:90) 10:31:18.589 [ERROR] [org.gradle.BuildExceptionReporter] at groovy.lang.MetaMethod.doMethodInvoke(MetaMethod.java:233) 10:31:18.589 [ERROR] [org.gradle.BuildExceptionReporter] at org.codehaus.groovy.runtime.metaclass.ClosureMetaClass.invokeMethod(ClosureMetaClass.java:272) 10:31:18.589 [ERROR] [org.gradle.BuildExceptionReporter] at groovy.lang.MetaClassImpl.invokeMethod(MetaClassImpl.java:877) 10:31:18.589 [ERROR] [org.gradle.BuildExceptionReporter] at groovy.lang.Closure.call(Closure.java:412) 10:31:18.589 [ERROR] [org.gradle.BuildExceptionReporter] at groovy.lang.Closure.call(Closure.java:425) 10:31:18.589 [ERROR] [org.gradle.BuildExceptionReporter] at org.gradle.api.internal.AbstractTask$ClosureTaskAction.execute(AbstractTask.java:502) 10:31:18.589 [ERROR] [org.gradle.BuildExceptionReporter] at org.gradle.api.internal.AbstractTask$ClosureTaskAction.execute(AbstractTask.java:483) 10:31:18.589 [ERROR] [org.gradle.BuildExceptionReporter] at org.gradle.api.internal.tasks.execution.ExecuteActionsTaskExecuter.executeAction(ExecuteActionsTaskExecuter.java:80) 10:31:18.589 [ERROR] [org.gradle.BuildExceptionReporter] at org.gradle.api.internal.tasks.execution.ExecuteActionsTaskExecuter.executeActions(ExecuteActionsTaskExecuter.java:61) 10:31:18.589 [ERROR] [org.gradle.BuildExceptionReporter] … 53 more 10:31:18.589 [ERROR] [org.gradle.BuildExceptionReporter] Caused by: org.gradle.api.internal.artifacts.ivyservice.ModuleVersionResolveException: Could not resolve -DEVELOPMENT-SNAP:rce=“true” conf="compile->com:,master(*);runtime->runt. 10:31:18.589 [ERROR] [org.gradle.BuildExceptionReporter] Required by: 10:31:18.589 [ERROR] [org.gradle.BuildExceptionReporter]

FAW.web:cacApp:LATEST-DEVELOPMENT-SNAPSHOT > FAW.web.functions:web.functions.onlineQuote:LATEST-DEVELOPMENT-SNAPSHOT 10:31:18.589 [ERROR] [org.gradle.BuildExceptionReporter] at org.gradle.api.internal.artifacts.ivyservice.ivyresolve.UserResolverChain.resolve(UserResolverChain.java:67) 10:31:18.589 [ERROR] [org.gradle.BuildExceptionReporter] at org.gradle.api.internal.artifacts.ivyservice.clientmodule.ClientModuleResolver.resolve(ClientModuleResolver.java:34) 10:31:18.589 [ERROR] [org.gradle.BuildExceptionReporter] at org.gradle.api.internal.artifacts.ivyservice.projectmodule.ProjectDependencyResolver.resolve(ProjectDependencyResolver.java:48) 10:31:18.589 [ERROR] [org.gradle.BuildExceptionReporter] at org.gradle.api.internal.artifacts.ivyservice.ivyresolve.LazyDependencyToModuleResolver$AbstractVersionResolveResult.resolve(LazyDependencyToModuleResolver.java:86) 10:31:18.589 [ERROR] [org.gradle.BuildExceptionReporter] at org.gradle.api.internal.artifacts.ivyservice.resolveengine.DependencyGraphBuilder$ModuleVersionResolveState.resolve(DependencyGraphBuilder.java:649) 10:31:18.589 [ERROR] [org.gradle.BuildExceptionReporter] at org.gradle.api.internal.artifacts.ivyservice.resolveengine.DependencyGraphBuilder$ModuleVersionResolveState.getMetaData(DependencyGraphBuilder.java:660) 10:31:18.590 [ERROR] [org.gradle.BuildExceptionReporter] at org.gradle.api.internal.artifacts.ivyservice.resolveengine.DependencyGraphBuilder$DependencyEdge.calculateTargetConfigurations(DependencyGraphBuilder.java:336) 10:31:18.590 [ERROR] [org.gradle.BuildExceptionReporter] at org.gradle.api.internal.artifacts.ivyservice.resolveengine.DependencyGraphBuilder$DependencyEdge.attachToTargetConfigurations(DependencyGraphBuilder.java:310) 10:31:18.590 [ERROR] [org.gradle.BuildExceptionReporter] at org.gradle.api.internal.artifacts.ivyservice.resolveengine.DependencyGraphBuilder.traverseGraph(DependencyGraphBuilder.java:126) 10:31:18.590 [ERROR] [org.gradle.BuildExceptionReporter] at org.gradle.api.internal.artifacts.ivyservice.resolveengine.DependencyGraphBuilder.resolve(DependencyGraphBuilder.java:66) 10:31:18.590 [ERROR] [org.gradle.BuildExceptionReporter] at org.gradle.api.internal.artifacts.ivyservice.resolveengine.DefaultDependencyResolver$1.transform(DefaultDependencyResolver.java:108) 10:31:18.590 [ERROR] [org.gradle.BuildExceptionReporter] at org.gradle.api.internal.artifacts.ivyservice.resolveengine.DefaultDependencyResolver$1.transform(DefaultDependencyResolver.java:77) 10:31:18.590 [ERROR] [org.gradle.BuildExceptionReporter] at org.gradle.api.internal.artifacts.ivyservice.DefaultIvyContextManager.withIvy(DefaultIvyContextManager.java:61) 10:31:18.590 [ERROR] [org.gradle.BuildExceptionReporter] at org.gradle.api.internal.artifacts.ivyservice.resolveengine.DefaultDependencyResolver.resolve(DefaultDependencyResolver.java:77) 10:31:18.590 [ERROR] [org.gradle.BuildExceptionReporter] at org.gradle.api.internal.artifacts.ivyservice.CacheLockingArtifactDependencyResolver$1.create(CacheLockingArtifactDependencyResolver.java:39) 10:31:18.590 [ERROR] [org.gradle.BuildExceptionReporter] at org.gradle.api.internal.artifacts.ivyservice.CacheLockingArtifactDependencyResolver$1.create(CacheLockingArtifactDependencyResolver.java:37) 10:31:18.590 [ERROR] [org.gradle.BuildExceptionReporter] at org.gradle.cache.internal.DefaultCacheAccess.useCache(DefaultCacheAccess.java:148) 10:31:18.590 [ERROR] [org.gradle.BuildExceptionReporter] at org.gradle.cache.internal.DefaultPersistentDirectoryStore.useCache(DefaultPersistentDirectoryStore.java:123) 10:31:18.590 [ERROR] [org.gradle.BuildExceptionReporter] at org.gradle.api.internal.artifacts.ivyservice.DefaultCacheLockingManager.useCache(DefaultCacheLockingManager.java:77) 10:31:18.590 [ERROR] [org.gradle.BuildExceptionReporter] at org.gradle.api.internal.artifacts.ivyservice.CacheLockingArtifactDependencyResolver.resolve(CacheLockingArtifactDependencyResolver.java:37) 10:31:18.590 [ERROR] [org.gradle.BuildExceptionReporter] at org.gradle.api.internal.artifacts.ivyservice.SelfResolvingDependencyResolver.resolve(SelfResolvingDependencyResolver.java:41) 10:31:18.590 [ERROR] [org.gradle.BuildExceptionReporter] at org.gradle.api.internal.artifacts.ivyservice.ShortcircuitEmptyConfigsArtifactDependencyResolver.resolve(ShortcircuitEmptyConfigsArtifactDependencyResolver.java:46) 10:31:18.590 [ERROR] [org.gradle.BuildExceptionReporter] at org.gradle.api.internal.artifacts.ivyservice.ErrorHandlingArtifactDependencyResolver.resolve(ErrorHandlingArtifactDependencyResolver.java:44) 10:31:18.590 [ERROR] [org.gradle.BuildExceptionReporter] at org.gradle.api.internal.artifacts.ivyservice.DefaultConfigurationResolver.resolve(DefaultConfigurationResolver.java:42) 10:31:18.590 [ERROR] [org.gradle.BuildExceptionReporter] at org.gradle.api.internal.artifacts.configurations.DefaultConfiguration.resolveNow(DefaultConfiguration.java:240) 10:31:18.590 [ERROR] [org.gradle.BuildExceptionReporter] at org.gradle.api.internal.artifacts.configurations.DefaultConfiguration.getResolvedConfiguration(DefaultConfiguration.java:230) 10:31:18.590 [ERROR] [org.gradle.BuildExceptionReporter] at org.gradle.api.internal.artifacts.configurations.DefaultConfiguration_Decorated.getResolvedConfiguration(Unknown Source) 10:31:18.590 [ERROR] [org.gradle.BuildExceptionReporter] at sun.reflect.NativeMethodAccessorImpl.invoke0(Native Method) 10:31:18.590 [ERROR] [org.gradle.BuildExceptionReporter] at sun.reflect.NativeMethodAccessorImpl.invoke(NativeMethodAccessorImpl.java:39) 10:31:18.590 [ERROR] [org.gradle.BuildExceptionReporter] at sun.reflect.DelegatingMethodAccessorImpl.invoke(DelegatingMethodAccessorImpl.java:25) 10:31:18.590 [ERROR] [org.gradle.BuildExceptionReporter] at java.lang.reflect.Method.invoke(Method.java:597) 10:31:18.590 [ERROR] [org.gradle.BuildExceptionReporter] at org.codehaus.groovy.reflection.CachedMethod.invoke(CachedMethod.java:90) 10:31:18.590 [ERROR] [org.gradle.BuildExceptionReporter] at groovy.lang.MetaBeanProperty.getProperty(MetaBeanProperty.java:57) 10:31:18.591 [ERROR] [org.gradle.BuildExceptionReporter] at org.gradle.api.internal.BeanDynamicObject$MetaClassAdapter.getProperty(BeanDynamicObject.java:158) 10:31:18.591 [ERROR] [org.gradle.BuildExceptionReporter] at org.gradle.api.internal.BeanDynamicObject.getProperty(BeanDynamicObject.java:112) 10:31:18.591 [ERROR] [org.gradle.BuildExceptionReporter] at org.gradle.api.internal.CompositeDynamicObject.getProperty(CompositeDynamicObject.java:78) 10:31:18.591 [ERROR] [org.gradle.BuildExceptionReporter] at org.gradle.api.internal.artifacts.configurations.DefaultConfiguration_Decorated.getProperty(Unknown Source) 10:31:18.591 [ERROR] [org.gradle.BuildExceptionReporter] at org.codehaus.groovy.runtime.callsite.PogoGetPropertySite.getProperty(PogoGetPropertySite.java:47) 10:31:18.591 [ERROR] [org.gradle.BuildExceptionReporter] … 69 more 10:31:18.591 [ERROR] [org.gradle.BuildExceptionReporter] Caused by: java.lang.IllegalArgumentException 10:31:18.591 [ERROR] [org.gradle.BuildExceptionReporter] at java.net.URI.create(URI.java:842) 10:31:18.591 [ERROR] [org.gradle.BuildExceptionReporter] at org.apache.http.client.methods.HttpGet.(HttpGet.java:69) 10:31:18.591 [ERROR] [org.gradle.BuildExceptionReporter] at org.gradle.api.internal.externalresource.transport.http.HttpClientHelper.performRawGet(HttpClientHelper.java:66) 10:31:18.591 [ERROR] [org.gradle.BuildExceptionReporter] at org.gradle.api.internal.externalresource.transport.http.HttpClientHelper.performGet(HttpClientHelper.java:70) 10:31:18.591 [ERROR] [org.gradle.BuildExceptionReporter] at org.gradle.api.internal.externalresource.transport.http.HttpResourceAccessor.getResource(HttpResourceAccessor.java:46) 10:31:18.591 [ERROR] [org.gradle.BuildExceptionReporter] at org.gradle.api.internal.externalresource.transport.http.HttpResourceAccessor.getResource(HttpResourceAccessor.java:32) 10:31:18.591 [ERROR] [org.gradle.BuildExceptionReporter] at org.gradle.api.internal.externalresource.transfer.ProgressLoggingExternalResourceAccessor.getResource(ProgressLoggingExternalResourceAccessor.java:38) 10:31:18.591 [ERROR] [org.gradle.BuildExceptionReporter] at org.gradle.api.internal.externalresource.transfer.DefaultCacheAwareExternalResourceAccessor.getResource(DefaultCacheAwareExternalResourceAccessor.java:60) 10:31:18.591 [ERROR] [org.gradle.BuildExceptionReporter] at org.gradle.api.internal.externalresource.transport.DefaultExternalResourceRepository.getResource(DefaultExternalResourceRepository.java:65) 10:31:18.591 [ERROR] [org.gradle.BuildExceptionReporter] at org.gradle.api.internal.artifacts.repositories.resolver.ExternalResourceResolver.getResource(ExternalResourceResolver.java:427) 10:31:18.591 [ERROR] [org.gradle.BuildExceptionReporter] at org.gradle.api.internal.artifacts.repositories.resolver.ExternalResourceResolver.findStaticResourceUsingPatterns(ExternalResourceResolver.java:307) 10:31:18.591 [ERROR] [org.gradle.BuildExceptionReporter] at org.gradle.api.internal.artifacts.repositories.resolver.ExternalResourceResolver.findMetaDataFileUsingAnyPattern(ExternalResourceResolver.java:266) 10:31:18.591 [ERROR] [org.gradle.BuildExceptionReporter] at org.gradle.api.internal.artifacts.repositories.resolver.ExternalResourceResolver.findStaticDependency(ExternalResourceResolver.java:170) 10:31:18.591 [ERROR] [org.gradle.BuildExceptionReporter] at org.gradle.api.internal.artifacts.repositories.resolver.ExternalResourceResolver.getDependency(ExternalResourceResolver.java:165) 10:31:18.591 [ERROR] [org.gradle.BuildExceptionReporter] at org.gradle.api.internal.artifacts.repositories.resolver.MavenResolver.getDependency(MavenResolver.java:81) 10:31:18.591 [ERROR] [org.gradle.BuildExceptionReporter] at org.gradle.api.internal.artifacts.repositories.resolver.ExternalResourceResolver.getDependency(ExternalResourceResolver.java:157) 10:31:18.591 [ERROR] [org.gradle.BuildExceptionReporter] at org.gradle.api.internal.artifacts.ivyservice.ivyresolve.CacheLockingModuleVersionRepository$1.run(CacheLockingModuleVersionRepository.java:46) 10:31:18.591 [ERROR] [org.gradle.BuildExceptionReporter] at org.gradle.internal.Factories$1.create(Factories.java:22) 10:31:18.591 [ERROR] [org.gradle.BuildExceptionReporter] at org.gradle.cache.internal.DefaultCacheAccess.longRunningOperation(DefaultCacheAccess.java:198) 10:31:18.591 [ERROR] [org.gradle.BuildExceptionReporter] at org.gradle.cache.internal.DefaultCacheAccess.longRunningOperation(DefaultCacheAccess.java:266) 10:31:18.591 [ERROR] [org.gradle.BuildExceptionReporter] at org.gradle.cache.internal.DefaultPersistentDirectoryStore.longRunningOperation(DefaultPersistentDirectoryStore.java:135) 10:31:18.591 [ERROR] [org.gradle.BuildExceptionReporter] at org.gradle.api.internal.artifacts.ivyservice.DefaultCacheLockingManager.longRunningOperation(DefaultCacheLockingManager.java:73) 10:31:18.591 [ERROR] [org.gradle.BuildExceptionReporter] at org.gradle.api.internal.artifacts.ivyservice.ivyresolve.CacheLockingModuleVersionRepository.getDependency(CacheLockingModuleVersionRepository.java:44) 10:31:18.592 [ERROR] [org.gradle.BuildExceptionReporter] at org.gradle.api.internal.artifacts.ivyservice.ivyresolve.CachingModuleVersionRepository.getDependency(CachingModuleVersionRepository.java:90) 10:31:18.592 [ERROR] [org.gradle.BuildExceptionReporter] at org.gradle.api.internal.artifacts.ivyservice.ivyresolve.memcache.CachedRepository.getDependency(CachedRepository.java:55) 10:31:18.592 [ERROR] [org.gradle.BuildExceptionReporter] at org.gradle.api.internal.artifacts.ivyservice.ivyresolve.UserResolverChain$RepositoryResolveState.resolve(UserResolverChain.java:184) 10:31:18.592 [ERROR] [org.gradle.BuildExceptionReporter] at org.gradle.api.internal.artifacts.ivyservice.ivyresolve.UserResolverChain.findLatestModule(UserResolverChain.java:98) 10:31:18.592 [ERROR] [org.gradle.BuildExceptionReporter] at org.gradle.api.internal.artifacts.ivyservice.ivyresolve.UserResolverChain.findLatestModule(UserResolverChain.java:81) 10:31:18.592 [ERROR] [org.gradle.BuildExceptionReporter] at org.gradle.api.internal.artifacts.ivyservice.ivyresolve.UserResolverChain.resolve(UserResolverChain.java:56) 10:31:18.592 [ERROR] [org.gradle.BuildExceptionReporter] … 106 more 10:31:18.592 [ERROR] [org.gradle.BuildExceptionReporter] Caused by: java.net.URISyntaxException: Illegal character in path at index 60: http://fawbuilder.momentum.co.za/repo/-DEVELOPMENT-SNAP/rce=“true” conf="compile->com/,master();runtime->runt/rce=“true” conf="compile->com-,master();runtime->runt.pom 10:31:18.592 [ERROR] [org.gradle.BuildExceptionReporter] at java.net.URI$Parser.fail(URI.java:2809) 10:31:18.592 [ERROR] [org.gradle.BuildExceptionReporter] at java.net.URI$Parser.checkChars(URI.java:2982) 10:31:18.592 [ERROR] [org.gradle.BuildExceptionReporter] at java.net.URI$Parser.parseHierarchical(URI.java:3066) 10:31:18.592 [ERROR] [org.gradle.BuildExceptionReporter] at java.net.URI$Parser.parse(URI.java:3014) 10:31:18.592 [ERROR] [org.gradle.BuildExceptionReporter] at java.net.URI.(URI.java:578) 10:31:18.592 [ERROR] [org.gradle.BuildExceptionReporter] at java.net.URI.create(URI.java:840) 10:31:18.592 [ERROR] [org.gradle.BuildExceptionReporter] … 134 more 10:31:18.592 [ERROR] [org.gradle.BuildExceptionReporter]


(Szczepan Faber) #2

Hey,

Thanks for reporting. Can you try latest nightly and tell me if it resolves the problem: http://www.gradle.org/nightly

Yesterday I’ve pushed a change for xml generation and it should be included in the nightly.

Thanks a lot in advance.


(Corneil du Plessis) #3

I tried with 1.11-20140115042747+0000 and it worked as expected. I am looking forward to the 1.11 release.


(Szczepan Faber) #4

Beautiful, thanks so much for feedback.