Gradle build failure with the below error


(Otonye Clement) #1

I just upgraded to gradle 4.6 on my android studio platform, but anytime i run my project i get the error below. Please help.

Error:04:30:15.710 [ERROR] [org.gradle.internal.buildevents.BuildExceptionReporter]
04:30:15.710 [ERROR] [org.gradle.internal.buildevents.BuildExceptionReporter] FAILURE: Build failed with an exception.
04:30:15.710 [ERROR] [org.gradle.internal.buildevents.BuildExceptionReporter]
04:30:15.710 [ERROR] [org.gradle.internal.buildevents.BuildExceptionReporter] * What went wrong:
04:30:15.710 [ERROR] [org.gradle.internal.buildevents.BuildExceptionReporter] Execution failed for task ‘:app:mergeDebugResources’.
04:30:15.710 [ERROR] [org.gradle.internal.buildevents.BuildExceptionReporter] > java.util.concurrent.ExecutionException: com.android.builder.internal.aapt.v2.Aapt2InternalException: AAPT2 aapt2-3.2.0-alpha18-4804415-windows Daemon #0: Daemon startup failed
04:30:15.711 [ERROR] [org.gradle.internal.buildevents.BuildExceptionReporter] This should not happen under normal circumstances, please file an issue if it does.
04:30:15.711 [ERROR] [org.gradle.internal.buildevents.BuildExceptionReporter]
04:30:15.711 [ERROR] [org.gradle.internal.buildevents.BuildExceptionReporter] * Try:
04:30:15.711 [ERROR] [org.gradle.internal.buildevents.BuildExceptionReporter] Run with --scan to get full insights.
04:30:15.711 [ERROR] [org.gradle.internal.buildevents.BuildExceptionReporter]
04:30:15.711 [ERROR] [org.gradle.internal.buildevents.BuildExceptionReporter] * Exception is:
04:30:15.711 [ERROR] [org.gradle.internal.buildevents.BuildExceptionReporter] org.gradle.api.tasks.TaskExecutionException: Execution failed for task ‘:app:mergeDebugResources’.
04:30:15.711 [ERROR] [org.gradle.internal.buildevents.BuildExceptionReporter] at org.gradle.api.internal.tasks.execution.ExecuteActionsTaskExecuter.executeActions(ExecuteActionsTaskExecuter.java:103)
04:30:15.711 [ERROR] [org.gradle.internal.buildevents.BuildExceptionReporter] at org.gradle.api.internal.tasks.execution.ExecuteActionsTaskExecuter.execute(ExecuteActionsTaskExecuter.java:73)
04:30:15.712 [ERROR] [org.gradle.internal.buildevents.BuildExceptionReporter] at org.gradle.api.internal.tasks.execution.OutputDirectoryCreatingTaskExecuter.execute(OutputDirectoryCreatingTaskExecuter.java:51)
04:30:15.712 [ERROR] [org.gradle.internal.buildevents.BuildExceptionReporter] at org.gradle.api.internal.tasks.execution.SkipUpToDateTaskExecuter.execute(SkipUpToDateTaskExecuter.java:59)
04:30:15.712 [ERROR] [org.gradle.internal.buildevents.BuildExceptionReporter] at org.gradle.api.internal.tasks.execution.ResolveTaskOutputCachingStateExecuter.execute(ResolveTaskOutputCachingStateExecuter.java:54)
04:30:15.712 [ERROR] [org.gradle.internal.buildevents.BuildExceptionReporter] at org.gradle.api.internal.tasks.execution.ValidatingTaskExecuter.execute(ValidatingTaskExecuter.java:59)
04:30:15.712 [ERROR] [org.gradle.internal.buildevents.BuildExceptionReporter] at org.gradle.api.internal.tasks.execution.SkipEmptySourceFilesTaskExecuter.execute(SkipEmptySourceFilesTaskExecuter.java:101)
04:30:15.712 [ERROR] [org.gradle.internal.buildevents.BuildExceptionReporter] at org.gradle.api.internal.tasks.execution.FinalizeInputFilePropertiesTaskExecuter.execute(FinalizeInputFilePropertiesTaskExecuter.java:44)
04:30:15.712 [ERROR] [org.gradle.internal.buildevents.BuildExceptionReporter] at org.gradle.api.internal.tasks.execution.CleanupStaleOutputsExecuter.execute(CleanupStaleOutputsExecuter.java:91)
04:30:15.712 [ERROR] [org.gradle.internal.buildevents.BuildExceptionReporter] at org.gradle.api.internal.tasks.execution.ResolveTaskArtifactStateTaskExecuter.execute(ResolveTaskArtifactStateTaskExecuter.java:62)
04:30:15.712 [ERROR] [org.gradle.internal.buildevents.BuildExceptionReporter] at org.gradle.api.internal.tasks.execution.SkipTaskWithNoActionsExecuter.execute(SkipTaskWithNoActionsExecuter.java:59)
04:30:15.712 [ERROR] [org.gradle.internal.buildevents.BuildExceptionReporter] at org.gradle.api.internal.tasks.execution.SkipOnlyIfTaskExecuter.execute(SkipOnlyIfTaskExecuter.java:54)
04:30:15.712 [ERROR] [org.gradle.internal.buildevents.BuildExceptionReporter] at org.gradle.api.internal.tasks.execution.ExecuteAtMostOnceTaskExecuter.execute(ExecuteAtMostOnceTaskExecuter.java:43)
04:30:15.713 [ERROR] [org.gradle.internal.buildevents.BuildExceptionReporter] at org.gradle.api.internal.tasks.execution.CatchExceptionTaskExecuter.execute(CatchExceptionTaskExecuter.java:34)
04:30:15.713 [ERROR] [org.gradle.internal.buildevents.BuildExceptionReporter] at org.gradle.execution.taskgraph.DefaultTaskGraphExecuter$EventFiringTaskWorker$1.run(DefaultTaskGraphExecuter.java:256)
04:30:15.713 [ERROR] [org.gradle.internal.buildevents.BuildExceptionReporter] at org.gradle.internal.progress.DefaultBuildOperationExecutor$RunnableBuildOperationWorker.execute(DefaultBuildOperationExecutor.java:336)
04:30:15.713 [ERROR] [org.gradle.internal.buildevents.BuildExceptionReporter] at org.gradle.internal.progress.DefaultBuildOperationExecutor$RunnableBuildOperationWorker.execute(DefaultBuildOperationExecutor.java:328)
04:30:15.713 [ERROR] [org.gradle.internal.buildevents.BuildExceptionReporter] at org.gradle.internal.progress.DefaultBuildOperationExecutor.execute(DefaultBuildOperationExecutor.java:199)
04:30:15.713 [ERROR] [org.gradle.internal.buildevents.BuildExceptionReporter] at org.gradle.internal.progress.DefaultBuildOperationExecutor.run(DefaultBuildOperationExecutor.java:110)
04:30:15.713 [ERROR] [org.gradle.internal.buildevents.BuildExceptionReporter] at org.gradle.execution.taskgraph.DefaultTaskGraphExecuter$EventFiringTaskWorker.execute(DefaultTaskGraphExecuter.java:249)
04:30:15.713 [ERROR] [org.gradle.internal.buildevents.BuildExceptionReporter] at org.gradle.execution.taskgraph.DefaultTaskGraphExecuter$EventFiringTaskWorker.execute(DefaultTaskGraphExecuter.java:238)
04:30:15.713 [ERROR] [org.gradle.internal.buildevents.BuildExceptionReporter] at org.gradle.execution.taskgraph.DefaultTaskPlanExecutor$TaskExecutorWorker.processTask(DefaultTaskPlanExecutor.java:123)
04:30:15.713 [ERROR] [org.gradle.internal.buildevents.BuildExceptionReporter] at org.gradle.execution.taskgraph.DefaultTaskPlanExecutor$TaskExecutorWorker.access$200(DefaultTaskPlanExecutor.java:79)
04:30:15.713 [ERROR] [org.gradle.internal.buildevents.BuildExceptionReporter] at org.gradle.execution.taskgraph.DefaultTaskPlanExecutor$TaskExecutorWorker$1.execute(DefaultTaskPlanExecutor.java:104)
04:30:15.713 [ERROR] [org.gradle.internal.buildevents.BuildExceptionReporter] at org.gradle.execution.taskgraph.DefaultTaskPlanExecutor$TaskExecutorWorker$1.execute(DefaultTaskPlanExecutor.java:98)
04:30:15.713 [ERROR] [org.gradle.internal.buildevents.BuildExceptionReporter] at org.gradle.execution.taskgraph.DefaultTaskExecutionPlan.execute(DefaultTaskExecutionPlan.java:663)
04:30:15.713 [ERROR] [org.gradle.internal.buildevents.BuildExceptionReporter] at org.gradle.execution.taskgraph.DefaultTaskExecutionPlan.executeWithTask(DefaultTaskExecutionPlan.java:597)
04:30:15.714 [ERROR] [org.gradle.internal.buildevents.BuildExceptionReporter] at org.gradle.execution.taskgraph.DefaultTaskPlanExecutor$TaskExecutorWorker.run(DefaultTaskPlanExecutor.java:98)
04:30:15.714 [ERROR] [org.gradle.internal.buildevents.BuildExceptionReporter] at org.gradle.execution.taskgraph.DefaultTaskPlanExecutor.process(DefaultTaskPlanExecutor.java:59)
04:30:15.714 [ERROR] [org.gradle.internal.buildevents.BuildExceptionReporter] at org.gradle.execution.taskgraph.DefaultTaskGraphExecuter.execute(DefaultTaskGraphExecuter.java:130)
04:30:15.714 [ERROR] [org.gradle.internal.buildevents.BuildExceptionReporter] at org.gradle.execution.SelectedTaskExecutionAction.execute(SelectedTaskExecutionAction.java:37)
04:30:15.714 [ERROR] [org.gradle.internal.buildevents.BuildExceptionReporter] at org.gradle.execution.DefaultBuildExecuter.execute(DefaultBuildExecuter.java:37)
04:30:15.714 [ERROR] [org.gradle.internal.buildevents.BuildExceptionReporter] at org.gradle.execution.DefaultBuildExecuter.access$000(DefaultBuildExecuter.java:23)
04:30:15.714 [ERROR] [org.gradle.internal.buildevents.BuildExceptionReporter] at org.gradle.execution.DefaultBuildExecuter$1.proceed(DefaultBuildExecuter.java:43)
04:30:15.714 [ERROR] [org.gradle.internal.buildevents.BuildExceptionReporter] at org.gradle.execution.DryRunBuildExecutionAction.execute(DryRunBuildExecutionAction.java:46)
04:30:15.714 [ERROR] [org.gradle.internal.buildevents.BuildExceptionReporter] at org.gradle.execution.DefaultBuildExecuter.execute(DefaultBuildExecuter.java:37)
04:30:15.714 [ERROR] [org.gradle.internal.buildevents.BuildExceptionReporter] at org.gradle.execution.DefaultBuildExecuter.execute(DefaultBuildExecuter.java:30)
04:30:15.715 [ERROR] [org.gradle.internal.buildevents.BuildExceptionReporter] at org.gradle.initialization.DefaultGradleLauncher$ExecuteTasks.run(DefaultGradleLauncher.java:336)
04:30:15.715 [ERROR] [org.gradle.internal.buildevents.BuildExceptionReporter] at org.gradle.internal.progress.DefaultBuildOperationExecutor$RunnableBuildOperationWorker.execute(DefaultBuildOperationExecutor.java:336)
04:30:15.716 [ERROR] [org.gradle.internal.buildevents.BuildExceptionReporter] at org.gradle.internal.progress.DefaultBuildOperationExecutor$RunnableBuildOperationWorker.execute(DefaultBuildOperationExecutor.java:328)
04:30:15.716 [ERROR] [org.gradle.internal.buildevents.BuildExceptionReporter] at org.gradle.internal.progress.DefaultBuildOperationExecutor.execute(DefaultBuildOperationExecutor.java:199)
04:30:15.716 [ERROR] [org.gradle.internal.buildevents.BuildExceptionReporter] at org.gradle.internal.progress.DefaultBuildOperationExecutor.run(DefaultBuildOperationExecutor.java:110)
04:30:15.716 [ERROR] [org.gradle.internal.buildevents.BuildExceptionReporter] at org.gradle.initialization.DefaultGradleLauncher.runTasks(DefaultGradleLauncher.java:210)
04:30:15.716 [ERROR] [org.gradle.internal.buildevents.BuildExceptionReporter] at org.gradle.initialization.DefaultGradleLauncher.doBuildStages(DefaultGradleLauncher.java:140)
04:30:15.716 [ERROR] [org.gradle.internal.buildevents.BuildExceptionReporter] at org.gradle.initialization.DefaultGradleLauncher.executeTasks(DefaultGradleLauncher.java:115)
04:30:15.716 [ERROR] [org.gradle.internal.buildevents.BuildExceptionReporter] at org.gradle.internal.invocation.GradleBuildController$1.call(GradleBuildController.java:78)
04:30:15.716 [ERROR] [org.gradle.internal.buildevents.BuildExceptionReporter] at org.gradle.internal.invocation.GradleBuildController$1.call(GradleBuildController.java:75)
04:30:15.716 [ERROR] [org.gradle.internal.buildevents.BuildExceptionReporter] at org.gradle.internal.work.DefaultWorkerLeaseService.withLocks(DefaultWorkerLeaseService.java:152)
04:30:15.716 [ERROR] [org.gradle.internal.buildevents.BuildExceptionReporter] at org.gradle.internal.invocation.GradleBuildController.doBuild(GradleBuildController.java:100)
04:30:15.716 [ERROR] [org.gradle.internal.buildevents.BuildExceptionReporter] at org.gradle.internal.invocation.GradleBuildController.run(GradleBuildController.java:75)
04:30:15.716 [ERROR] [org.gradle.internal.buildevents.BuildExceptionReporter] at org.gradle.tooling.internal.provider.runner.BuildModelActionRunner.run(BuildModelActionRunner.java:53)
04:30:15.717 [ERROR] [org.gradle.internal.buildevents.BuildExceptionReporter] at org.gradle.launcher.exec.ChainingBuildActionRunner.run(ChainingBuildActionRunner.java:35)
04:30:15.717 [ERROR] [org.gradle.internal.buildevents.BuildExceptionReporter] at org.gradle.launcher.exec.ChainingBuildActionRunner.run(ChainingBuildActionRunner.java:35)
04:30:15.717 [ERROR] [org.gradle.internal.buildevents.BuildExceptionReporter] at org.gradle.tooling.internal.provider.ValidatingBuildActionRunner.run(ValidatingBuildActionRunner.java:32)
04:30:15.717 [ERROR] [org.gradle.internal.buildevents.BuildExceptionReporter] at org.gradle.launcher.exec.RunAsBuildOperationBuildActionRunner$1.run(RunAsBuildOperationBuildActionRunner.java:43)
04:30:15.717 [ERROR] [org.gradle.internal.buildevents.BuildExceptionReporter] at org.gradle.internal.progress.DefaultBuildOperationExecutor$RunnableBuildOperationWorker.execute(DefaultBuildOperationExecutor.java:336)
04:30:15.717 [ERROR] [org.gradle.internal.buildevents.BuildExceptionReporter] at org.gradle.internal.progress.DefaultBuildOperationExecutor$RunnableBuildOperationWorker.execute(DefaultBuildOperationExecutor.java:328)
04:30:15.717 [ERROR] [org.gradle.internal.buildevents.BuildExceptionReporter] at org.gradle.internal.progress.DefaultBuildOperationExecutor.execute(DefaultBuildOperationExecutor.java:199)
04:30:15.717 [ERROR] [org.gradle.internal.buildevents.BuildExceptionReporter] at org.gradle.internal.progress.DefaultBuildOperationExecutor.run(DefaultBuildOperationExecutor.java:110)
04:30:15.717 [ERROR] [org.gradle.internal.buildevents.BuildExceptionReporter] at org.gradle.launcher.exec.RunAsBuildOperationBuildActionRunner.run(RunAsBuildOperationBuildActionRunner.java:40)
04:30:15.717 [ERROR] [org.gradle.internal.buildevents.BuildExceptionReporter] at org.gradle.tooling.internal.provider.SubscribableBuildActionRunner.run(SubscribableBuildActionRunner.java:51)
04:30:15.717 [ERROR] [org.gradle.internal.buildevents.BuildExceptionReporter] at org.gradle.launcher.exec.InProcessBuildActionExecuter.execute(InProcessBuildActionExecuter.java:49)
04:30:15.717 [ERROR] [org.gradle.internal.buildevents.BuildExceptionReporter] at org.gradle.launcher.exec.InProcessBuildActionExecuter.execute(InProcessBuildActionExecuter.java:32)
04:30:15.717 [ERROR] [org.gradle.internal.buildevents.BuildExceptionReporter] at org.gradle.launcher.exec.BuildTreeScopeBuildActionExecuter.execute(BuildTreeScopeBuildActionExecuter.java:39)
04:30:15.718 [ERROR] [org.gradle.internal.buildevents.BuildExceptionReporter] at org.gradle.launcher.exec.BuildTreeScopeBuildActionExecuter.execute(BuildTreeScopeBuildActionExecuter.java:25)
04:30:15.718 [ERROR] [org.gradle.internal.buildevents.BuildExceptionReporter] at org.gradle.tooling.internal.provider.ContinuousBuildActionExecuter.execute(ContinuousBuildActionExecuter.java:80)
04:30:15.718 [ERROR] [org.gradle.internal.buildevents.BuildExceptionReporter] at org.gradle.tooling.internal.provider.ContinuousBuildActionExecuter.execute(ContinuousBuildActionExecuter.java:53)
04:30:15.718 [ERROR] [org.gradle.internal.buildevents.BuildExceptionReporter] at org.gradle.tooling.internal.provider.ServicesSetupBuildActionExecuter.execute(ServicesSetupBuildActionExecuter.java:57)
04:30:15.718 [ERROR] [org.gradle.internal.buildevents.BuildExceptionReporter] at org.gradle.tooling.internal.provider.ServicesSetupBuildActionExecuter.execute(ServicesSetupBuildActionExecuter.java:32)
04:30:15.718 [ERROR] [org.gradle.internal.buildevents.BuildExceptionReporter] at org.gradle.tooling.internal.provider.GradleThreadBuildActionExecuter.execute(GradleThreadBuildActionExecuter.java:36)
04:30:15.718 [ERROR] [org.gradle.internal.buildevents.BuildExceptionReporter] at org.gradle.tooling.internal.provider.GradleThreadBuildActionExecuter.execute(GradleThreadBuildActionExecuter.java:25)
04:30:15.718 [ERROR] [org.gradle.internal.buildevents.BuildExceptionReporter] at org.gradle.tooling.internal.provider.ParallelismConfigurationBuildActionExecuter.execute(ParallelismConfigurationBuildActionExecuter.java:43)
04:30:15.718 [ERROR] [org.gradle.internal.buildevents.BuildExceptionReporter] at org.gradle.tooling.internal.provider.ParallelismConfigurationBuildActionExecuter.execute(ParallelismConfigurationBuildActionExecuter.java:29)
04:30:15.718 [ERROR] [org.gradle.internal.buildevents.BuildExceptionReporter] at org.gradle.tooling.internal.provider.StartParamsValidatingActionExecuter.execute(StartParamsValidatingActionExecuter.java:64)
04:30:15.718 [ERROR] [org.gradle.internal.buildevents.BuildExceptionReporter] at org.gradle.tooling.internal.provider.StartParamsValidatingActionExecuter.execute(StartParamsValidatingActionExecuter.java:29)
04:30:15.719 [ERROR] [org.gradle.internal.buildevents.BuildExceptionReporter] at org.gradle.tooling.internal.provider.SessionFailureReportingActionExecuter.execute(SessionFailureReportingActionExecuter.java:59)
04:30:15.719 [ERROR] [org.gradle.internal.buildevents.BuildExceptionReporter] at org.gradle.tooling.internal.provider.SessionFailureReportingActionExecuter.execute(SessionFailureReportingActionExecuter.java:44)
04:30:15.719 [ERROR] [org.gradle.internal.buildevents.BuildExceptionReporter] at org.gradle.tooling.internal.provider.SetupLoggingActionExecuter.execute(SetupLoggingActionExecuter.java:45)
04:30:15.719 [ERROR] [org.gradle.internal.buildevents.BuildExceptionReporter] at org.gradle.tooling.internal.provider.SetupLoggingActionExecuter.execute(SetupLoggingActionExecuter.java:30)
04:30:15.719 [ERROR] [org.gradle.internal.buildevents.BuildExceptionReporter] at org.gradle.launcher.daemon.server.exec.ExecuteBuild.doBuild(ExecuteBuild.java:67)
04:30:15.719 [ERROR] [org.gradle.internal.buildevents.BuildExceptionReporter] at org.gradle.launcher.daemon.server.exec.BuildCommandOnly.execute(BuildCommandOnly.java:36)
04:30:15.720 [ERROR] [org.gradle.internal.buildevents.BuildExceptionReporter] at org.gradle.launcher.daemon.server.api.DaemonCommandExecution.proceed(DaemonCommandExecution.java:122)
04:30:15.720 [ERROR] [org.gradle.internal.buildevents.BuildExceptionReporter] at org.gradle.launcher.daemon.server.exec.WatchForDisconnection.execute(WatchForDisconnection.java:37)
04:30:15.720 [ERROR] [org.gradle.internal.buildevents.BuildExceptionReporter] at org.gradle.launcher.daemon.server.api.DaemonCommandExecution.proceed(DaemonCommandExecution.java:122)
04:30:15.720 [ERROR] [org.gradle.internal.buildevents.BuildExceptionReporter] at org.gradle.launcher.daemon.server.exec.ResetDeprecationLogger.execute(ResetDeprecationLogger.java:26)
04:30:15.720 [ERROR] [org.gradle.internal.buildevents.BuildExceptionReporter] at org.gradle.launcher.daemon.server.api.DaemonCommandExecution.proceed(DaemonCommandExecution.java:122)
04:30:15.720 [ERROR] [org.gradle.internal.buildevents.BuildExceptionReporter] at org.gradle.launcher.daemon.server.exec.RequestStopIfSingleUsedDaemon.execute(RequestStopIfSingleUsedDaemon.java:34)
04:30:15.720 [ERROR] [org.gradle.internal.buildevents.BuildExceptionReporter] at org.gradle.launcher.daemon.server.api.DaemonCommandExecution.proceed(DaemonCommandExecution.java:122)
04:30:15.720 [ERROR] [org.gradle.internal.buildevents.BuildExceptionReporter] at org.gradle.launcher.daemon.server.exec.ForwardClientInput$2.call(ForwardClientInput.java:74)
04:30:15.720 [ERROR] [org.gradle.internal.buildevents.BuildExceptionReporter] at org.gradle.launcher.daemon.server.exec.ForwardClientInput$2.call(ForwardClientInput.java:72)
04:30:15.720 [ERROR] [org.gradle.internal.buildevents.BuildExceptionReporter] at org.gradle.util.Swapper.swap(Swapper.java:38)
04:30:15.720 [ERROR] [org.gradle.internal.buildevents.BuildExceptionReporter] at org.gradle.launcher.daemon.server.exec.ForwardClientInput.execute(ForwardClientInput.java:72)
04:30:15.721 [ERROR] [org.gradle.internal.buildevents.BuildExceptionReporter] at org.gradle.launcher.daemon.server.api.DaemonCommandExecution.proceed(DaemonCommandExecution.java:122)
04:30:15.721 [ERROR] [org.gradle.internal.buildevents.BuildExceptionReporter] at org.gradle.launcher.daemon.server.exec.LogAndCheckHealth.execute(LogAndCheckHealth.java:55)
04:30:15.721 [ERROR] [org.gradle.internal.buildevents.BuildExceptionReporter] at org.gradle.launcher.daemon.server.api.DaemonCommandExecution.proceed(DaemonCommandExecution.java:122)
04:30:15.721 [ERROR] [org.gradle.internal.buildevents.BuildExceptionReporter] at org.gradle.launcher.daemon.server.exec.LogToClient.doBuild(LogToClient.java:62)
04:30:15.721 [ERROR] [org.gradle.internal.buildevents.BuildExceptionReporter] at org.gradle.launcher.daemon.server.exec.BuildCommandOnly.execute(BuildCommandOnly.java:36)
04:30:15.721 [ERROR] [org.gradle.internal.buildevents.BuildExceptionReporter] at org.gradle.launcher.daemon.server.api.DaemonCommandExecution.proceed(DaemonCommandExecution.java:122)
04:30:15.721 [ERROR] [org.gradle.internal.buildevents.BuildExceptionReporter] at org.gradle.launcher.daemon.server.exec.EstablishBuildEnvironment.doBuild(EstablishBuildEnvironment.java:82)
04:30:15.721 [ERROR] [org.gradle.internal.buildevents.BuildExceptionReporter] at org.gradle.launcher.daemon.server.exec.BuildCommandOnly.execute(BuildCommandOnly.java:36)
04:30:15.721 [ERROR] [org.gradle.internal.buildevents.BuildExceptionReporter] at org.gradle.launcher.daemon.server.api.DaemonCommandExecution.proceed(DaemonCommandExecution.java:122)
04:30:15.721 [ERROR] [org.gradle.internal.buildevents.BuildExceptionReporter] at org.gradle.launcher.daemon.server.exec.StartBuildOrRespondWithBusy$1.run(StartBuildOrRespondWithBusy.java:50)
04:30:15.721 [ERROR] [org.gradle.internal.buildevents.BuildExceptionReporter] at org.gradle.launcher.daemon.server.DaemonStateCoordinator$1.run(DaemonStateCoordinator.java:295)
04:30:15.721 [ERROR] [org.gradle.internal.buildevents.BuildExceptionReporter] at org.gradle.internal.concurrent.ExecutorPolicy$CatchAndRecordFailures.onExecute(ExecutorPolicy.java:63)
04:30:15.721 [ERROR] [org.gradle.internal.buildevents.BuildExceptionReporter] at org.gradle.internal.concurrent.ManagedExecutorImpl$1.run(ManagedExecutorImpl.java:46)
04:30:15.722 [ERROR] [org.gradle.internal.buildevents.BuildExceptionReporter] at org.gradle.internal.concurrent.ThreadFactoryImpl$ManagedThreadRunnable.run(ThreadFactoryImpl.java:55)
04:30:15.722 [ERROR] [org.gradle.internal.buildevents.BuildExceptionReporter] Caused by: org.gradle.internal.UncheckedException: java.util.concurrent.ExecutionException: com.android.builder.internal.aapt.v2.Aapt2InternalException: AAPT2 aapt2-3.2.0-alpha18-4804415-windows Daemon #0: Daemon startup failed
04:30:15.722 [ERROR] [org.gradle.internal.buildevents.BuildExceptionReporter] This should not happen under normal circumstances, please file an issue if it does.
04:30:15.722 [ERROR] [org.gradle.internal.buildevents.BuildExceptionReporter] at org.gradle.internal.UncheckedException.throwAsUncheckedException(UncheckedException.java:63)
04:30:15.722 [ERROR] [org.gradle.internal.buildevents.BuildExceptionReporter] at org.gradle.internal.UncheckedException.throwAsUncheckedException(UncheckedException.java:40)
04:30:15.722 [ERROR] [org.gradle.internal.buildevents.BuildExceptionReporter] at org.gradle.internal.reflect.JavaMethod.invoke(JavaMethod.java:76)
04:30:15.722 [ERROR] [org.gradle.internal.buildevents.BuildExceptionReporter] at org.gradle.api.internal.project.taskfactory.IncrementalTaskAction.doExecute(IncrementalTaskAction.java:50)
04:30:15.722 [ERROR] [org.gradle.internal.buildevents.BuildExceptionReporter] at org.gradle.api.internal.project.taskfactory.StandardTaskAction.execute(StandardTaskAction.java:39)
04:30:15.722 [ERROR] [org.gradle.internal.buildevents.BuildExceptionReporter] at org.gradle.api.internal.project.taskfactory.StandardTaskAction.execute(StandardTaskAction.java:26)
04:30:15.722 [ERROR] [org.gradle.internal.buildevents.BuildExceptionReporter] at org.gradle.api.internal.tasks.execution.ExecuteActionsTaskExecuter$1.run(ExecuteActionsTaskExecuter.java:124)
04:30:15.722 [ERROR] [org.gradle.internal.buildevents.BuildExceptionReporter] at org.gradle.internal.progress.DefaultBuildOperationExecutor$RunnableBuildOperationWorker.execute(DefaultBuildOperationExecutor.java:336)
04:30:15.722 [ERROR] [org.gradle.internal.buildevents.BuildExceptionReporter] at org.gradle.internal.progress.DefaultBuildOperationExecutor$RunnableBuildOperationWorker.execute(DefaultBuildOperationExecutor.java:328)
04:30:15.722 [ERROR] [org.gradle.internal.buildevents.BuildExceptionReporter] at org.gradle.internal.progress.DefaultBuildOperationExecutor.execute(DefaultBuildOperationExecutor.java:199)
04:30:15.723 [ERROR] [org.gradle.internal.buildevents.BuildExceptionReporter] at org.gradle.internal.progress.DefaultBuildOperationExecutor.run(DefaultBuildOperationExecutor.java:110)
04:30:15.723 [ERROR] [org.gradle.internal.buildevents.BuildExceptionReporter] at org.gradle.api.internal.tasks.execution.ExecuteActionsTaskExecuter.executeAction(ExecuteActionsTaskExecuter.java:113)
04:30:15.723 [ERROR] [org.gradle.internal.buildevents.BuildExceptionReporter] at org.gradle.api.internal.tasks.execution.ExecuteActionsTaskExecuter.executeActions(ExecuteActionsTaskExecuter.java:95)
04:30:15.723 [ERROR] [org.gradle.internal.buildevents.BuildExceptionReporter] … 105 more
04:30:15.723 [ERROR] [org.gradle.internal.buildevents.BuildExceptionReporter] Caused by: java.util.concurrent.ExecutionException: com.android.builder.internal.aapt.v2.Aapt2InternalException: AAPT2 aapt2-3.2.0-alpha18-4804415-windows Daemon #0: Daemon startup failed
04:30:15.723 [ERROR] [org.gradle.internal.buildevents.BuildExceptionReporter] This should not happen under normal circumstances, please file an issue if it does.
04:30:15.723 [ERROR] [org.gradle.internal.buildevents.BuildExceptionReporter] at com.android.ide.common.workers.ExecutorServiceAdapter.close(ExecutorServiceAdapter.kt:56)
04:30:15.723 [ERROR] [org.gradle.internal.buildevents.BuildExceptionReporter] at com.android.build.gradle.internal.aapt.WorkerExecutorResourceCompilationService.close(WorkerExecutorResourceCompilationService.kt:67)
04:30:15.723 [ERROR] [org.gradle.internal.buildevents.BuildExceptionReporter] at com.android.build.gradle.tasks.MergeResources.doFullTaskAction(MergeResources.java:320)
04:30:15.723 [ERROR] [org.gradle.internal.buildevents.BuildExceptionReporter] at com.android.build.gradle.internal.tasks.IncrementalTask.taskAction(IncrementalTask.java:106)
04:30:15.723 [ERROR] [org.gradle.internal.buildevents.BuildExceptionReporter] at org.gradle.internal.reflect.JavaMethod.invoke(JavaMethod.java:73)
04:30:15.723 [ERROR] [org.gradle.internal.buildevents.BuildExceptionReporter] … 115 more
04:30:15.723 [ERROR] [org.gradle.internal.buildevents.BuildExceptionReporter] Caused by: com.android.builder.internal.aapt.v2.Aapt2InternalException: AAPT2 aapt2-3.2.0-alpha18-4804415-windows Daemon #0: Daemon startup failed
04:30:15.724 [ERROR] [org.gradle.internal.buildevents.BuildExceptionReporter] This should not happen under normal circumstances, please file an issue if it does.
04:30:15.724 [ERROR] [org.gradle.internal.buildevents.BuildExceptionReporter] at com.android.builder.internal.aapt.v2.Aapt2Daemon.handleError(Aapt2Daemon.kt:148)
04:30:15.724 [ERROR] [org.gradle.internal.buildevents.BuildExceptionReporter] at com.android.builder.internal.aapt.v2.Aapt2Daemon.checkStarted(Aapt2Daemon.kt:57)
04:30:15.724 [ERROR] [org.gradle.internal.buildevents.BuildExceptionReporter] at com.android.builder.internal.aapt.v2.Aapt2Daemon.compile(Aapt2Daemon.kt:79)
04:30:15.724 [ERROR] [org.gradle.internal.buildevents.BuildExceptionReporter] at com.android.builder.internal.aapt.v2.Aapt2DaemonManager$LeasedAaptDaemon.compile(Aapt2DaemonManager.kt:170)
04:30:15.724 [ERROR] [org.gradle.internal.buildevents.BuildExceptionReporter] at com.android.build.gradle.internal.res.Aapt2CompileWithBlameRunnable$run$1.invoke(Aapt2CompileWithBlameRunnable.kt:37)
04:30:15.724 [ERROR] [org.gradle.internal.buildevents.BuildExceptionReporter] at com.android.build.gradle.internal.res.Aapt2CompileWithBlameRunnable$run$1.invoke(Aapt2CompileWithBlameRunnable.kt:28)
04:30:15.724 [ERROR] [org.gradle.internal.buildevents.BuildExceptionReporter] at com.android.build.gradle.internal.res.namespaced.Aapt2DaemonManagerService.useAaptDaemon(Aapt2DaemonManagerService.kt:71)
04:30:15.724 [ERROR] [org.gradle.internal.buildevents.BuildExceptionReporter] at com.android.build.gradle.internal.res.namespaced.Aapt2DaemonManagerService.useAaptDaemon$default(Aapt2DaemonManagerService.kt:69)
04:30:15.724 [ERROR] [org.gradle.internal.buildevents.BuildExceptionReporter] at com.android.build.gradle.internal.res.Aapt2CompileWithBlameRunnable.run(Aapt2CompileWithBlameRunnable.kt:34)
04:30:15.724 [ERROR] [org.gradle.internal.buildevents.BuildExceptionReporter] at com.android.ide.common.workers.ExecutorServiceAdapter$submit$submission$1.run(ExecutorServiceAdapter.kt:39)
04:30:15.724 [ERROR] [org.gradle.internal.buildevents.BuildExceptionReporter] Caused by: com.android.builder.internal.aapt.v2.Aapt2InternalException: Failed to start AAPT2 process AAPT2 aapt2-3.2.0-alpha18-4804415-windows Daemon #0. Not ready within 30 seconds.
04:30:15.725 [ERROR] [org.gradle.internal.buildevents.BuildExceptionReporter] at com.android.builder.internal.aapt.v2.Aapt2DaemonImpl.stopQuietly(Aapt2DaemonImpl.kt:122)
04:30:15.725 [ERROR] [org.gradle.internal.buildevents.BuildExceptionReporter] at com.android.builder.internal.aapt.v2.Aapt2DaemonImpl.startProcess(Aapt2DaemonImpl.kt:102)
04:30:15.725 [ERROR] [org.gradle.internal.buildevents.BuildExceptionReporter] at com.android.builder.internal.aapt.v2.Aapt2Daemon.checkStarted(Aapt2Daemon.kt:53)
04:30:15.725 [ERROR] [org.gradle.internal.buildevents.BuildExceptionReporter] … 8 more
04:30:15.725 [ERROR] [org.gradle.internal.buildevents.BuildExceptionReporter] Caused by: java.util.concurrent.TimeoutException: Waited 30 seconds for com.google.common.util.concurrent.SettableFuture@1303fe7[status=PENDING]
04:30:15.725 [ERROR] [org.gradle.internal.buildevents.BuildExceptionReporter] at com.google.common.util.concurrent.AbstractFuture.get(AbstractFuture.java:442)
04:30:15.725 [ERROR] [org.gradle.internal.buildevents.BuildExceptionReporter] at com.google.common.util.concurrent.AbstractFuture$TrustedFuture.get(AbstractFuture.java:90)
04:30:15.725 [ERROR] [org.gradle.internal.buildevents.BuildExceptionReporter] at com.android.builder.internal.aapt.v2.Aapt2DaemonImpl.startProcess(Aapt2DaemonImpl.kt:100)
04:30:15.725 [ERROR] [org.gradle.internal.buildevents.BuildExceptionReporter] … 9 more
04:30:15.725 [ERROR] [org.gradle.internal.buildevents.BuildExceptionReporter]
04:30:15.725 [ERROR] [org.gradle.internal.buildevents.BuildExceptionReporter]
04:30:15.725 [ERROR] [org.gradle.internal.buildevents.BuildExceptionReporter] * Get more help at https://help.gradle.org
04:30:15.725 [ERROR] [org.gradle.internal.buildevents.BuildResultLogger]
04:30:15.726 [ERROR] [org.gradle.internal.buildevents.BuildResultLogger] BUILD FAILED in 45s