A failure occurred while executing com.android.build.gradle.internal.tasks.Workers$ActionFacade > AAPT2 aapt2-3.6.2-6040484-windows Daemon #0:

Hi I don’t know if anyone else is having the same problem as me? I’m relatively new to android studio and didn’t have a problem before installing the new updates. If anyone could give me a solution to my problem it would be very helpful.

FAILURE: Build failed with an exception.

  • What went wrong:
    Execution failed for task ‘:app:mergeDebugResources’.

Multiple task action failures occurred:
A failure occurred while executing com.android.build.gradle.internal.tasks.Workers$ActionFacade
AAPT2 aapt2-3.6.2-6040484-windows Daemon #0: Compile ‘E:\touchAndGoFin\app\src\main\res\drawable\fire.jpg’ timed out, attempting to stop daemon.
This should not happen under normal circumstances, please file an issue if it does.
A failure occurred while executing com.android.build.gradle.internal.tasks.Workers$ActionFacade
AAPT2 aapt2-3.6.2-6040484-windows Daemon #1: Compile ‘E:\touchAndGoFin\app\src\main\res\drawable\start.jpg’ timed out, attempting to stop daemon.
This should not happen under normal circumstances, please file an issue if it does.
A failure occurred while executing com.android.build.gradle.internal.tasks.Workers$ActionFacade
AAPT2 aapt2-3.6.2-6040484-windows Daemon #2: Compile ‘E:\touchAndGoFin\app\src\main\res\drawable\background.jpg’ timed out, attempting to stop daemon.
This should not happen under normal circumstances, please file an issue if it does.
A failure occurred while executing com.android.build.gradle.internal.tasks.Workers$ActionFacade
AAPT2 aapt2-3.6.2-6040484-windows Daemon #3: Compile ‘E:\touchAndGoFin\app\src\main\res\drawable\routes.jpg’ timed out, attempting to stop daemon.
This should not happen under normal circumstances, please file an issue if it does.
A failure occurred while executing com.android.build.gradle.internal.tasks.Workers$ActionFacade
AAPT2 aapt2-3.6.2-6040484-windows Daemon #7: Compile ‘E:\touchAndGoFin\app\src\main\res\drawable\tg.png’ timed out, attempting to stop daemon.
This should not happen under normal circumstances, please file an issue if it does.

  • Try:
    Run with --stacktrace option to get the stack trace. Run with --info or --debug option to get more log output. Run with --scan to get full insights.

  • Get more help at https://help.gradle.org

BUILD FAILED in 3m 27s
20 actionable tasks: 1 executed, 19 up-to-date

This is my constant problem Waited 2 minutes (plus 457200 nanoseconds delay) for com.google.common.util.concurrent.SettableFuture@2428bfd0[status=PENDING]

1 Like

Did you resolve this error? I am also facing similar error.

FAILURE: Build failed with an exception.

  • What went wrong:
    Execution failed for task ‘:launcher:processReleaseResources’.

A failure occurred while executing com.android.build.gradle.internal.tasks.Workers$ActionFacade
AAPT2 aapt2-3.6.0-6040484-osx Daemon #0: Unexpected error during link, attempting to stop daemon.
This should not happen under normal circumstances, please file an issue if it does.

  • Try:
    Run with --stacktrace option to get the stack trace. Run with --info or --debug option to get more log output. Run with --scan to get full insights.

  • Get more help at https://help.gradle.org