Jenkins Gradle build error

android

(monotonewang) #1

i have tried

gradle version 4.1
android.buildCacheDir=C:/Program Files
android.enableBuildCache=false
android.enableBuildAapt2=false
but it does not work? oh my god

:app:mergeWandoujiaDebugResourcesAAPT err(Facade for 643662806) : No Delegate set : lost message:\?\C:\Windows\System32\config\systemprofile.gradle\caches\transforms-1\files-1.1\appcompat-v7-25.4.0.aar\22f7ec1a0038dffd28e74c123c86377c\res\drawable-xhdpi-v4\abc_cab_background_top_mtrl_alpha.9.png ERROR: Unable to open PNG file
AAPT err(Facade for 643662806) : No Delegate set : lost message:\?\C:\Windows\System32\config\systemprofile.gradle\caches\transforms-1\files-1.1\appcompat-v7-25.4.0.aar\22f7ec1a0038dffd28e74c123c86377c\res\drawable-xhdpi-v4\abc_list_longpressed_holo.9.png ERROR: Unable to open PNG file
AAPT err(Facade for 643662806) : No Delegate set : lost message:\?\C:\Windows\System32\config\systemprofile.gradle\caches\transforms-1\files-1.1\appcompat-v7-25.4.0.aar\22f7ec1a0038dffd28e74c123c86377c\res\drawable-hdpi-v4\abc_list_divider_mtrl_alpha.9.png ERROR: Unable to open PNG file
AAPT err(Facade for 643662806) : No Delegate set : lost message:\?\C:\Windows\System32\config\systemprofile.gradle\caches\transforms-1\files-1.1\appcompat-v7-25.4.0.aar\22f7ec1a0038dffd28e74c123c86377c\res\drawable-mdpi-v4\notification_bg_low_pressed.9.png ERROR: Unable to open PNG file
AAPT err(Facade for 643662806) : No Delegate set : lost message:\?\C:\Windows\System32\config\systemprofile.gradle\caches\transforms-1\files-1.1\appcompat-v7-25.4.0.aar\22f7ec1a0038dffd28e74c123c86377c\res\drawable-xxhdpi-v4\abc_tab_indicator_mtrl_alpha.9.png ERROR: Unable to open PNG file
AAPT err(Facade for 643662806) : No Delegate set : lost message:\?\C:\Windows\System32\config\systemprofile.gradle\caches\transforms-1\files-1.1\appcompat-v7-25.4.0.aar\22f7ec1a0038dffd28e74c123c86377c\res\drawable-xhdpi-v4\abc_tab_indicator_mtrl_alpha.9.png ERROR: Unable to open PNG file
AAPT err(Facade for 643662806) : No Delegate set : lost message:\?\C:\Windows\System32\config\systemprofile.gradle\caches\transforms-1\files-1.1\appcompat-v7-25.4.0.aar\22f7ec1a0038dffd28e74c123c86377c\res\drawable-xhdpi-v4\abc_textfield_default_mtrl_alpha.9.png ERROR: Unable to open PNG file
AAPT err(Facade for 643662806) : No Delegate set : lost message:\?\C:\Windows\System32\config\systemprofile.gradle\caches\transforms-1\files-1.1\appcompat-v7-25.4.0.aar\22f7ec1a0038dffd28e74c123c86377c\res\drawable-xxhdpi-v4\abc_cab_background_top_mtrl_alpha.9.png ERROR: Unable to open PNG file
AAPT err(Facade for 643662806) : No Delegate set : lost message:\?\C:\Windows\System32\config\systemprofile.gradle\caches\transforms-1\files-1.1\appcompat-v7-25.4.0.aar\22f7ec1a0038dffd28e74c123c86377c\res\drawable-mdpi-v4\abc_scrubber_primary_mtrl_alpha.9.png ERROR: Unable to open PNG file
AAPT err(Facade for 643662806) : No Delegate set : lost message:\?\C:\Windows\System32\config\systemprofile.gradle\caches\transforms-1\files-1.1\appcompat-v7-25.4.0.aar\22f7ec1a0038dffd28e74c123c86377c\res\drawable-hdpi-v4\abc_list_pressed_holo_light.9.png ERROR: Unable to open PNG file
AAPT err(Facade for 643662806) : No Delegate set : lost message:\?\C:\Windows\System32\config\systemprofile.gradle\caches\transforms-1\files-1.1\appcompat-v7-25.4.0.aar\22f7ec1a0038dffd28e74c123c86377c\res\drawable-mdpi-v4\notification_bg_low_normal.9.png ERROR: Unable to open PNG file
AAPT err(Facade for 643662806) : No Delegate set : lost message:\?\C:\Windows\System32\config\systemprofile.gradle\caches\transforms-1\files-1.1\appcompat-v7-25.4.0.aar\22f7ec1a0038dffd28e74c123c86377c\res\drawable-xhdpi-v4\notification_bg_low_pressed.9.png ERROR: Unable to open PNG file
AAPT err(Facade for 643662806) : No Delegate set : lost message:\?\C:\Windows\System32\config\systemprofile.gradle\caches\transforms-1\files-1.1\appcompat-v7-25.4.0.aar\22f7ec1a0038dffd28e74c123c86377c\res\drawable-xxhdpi-v4\abc_popup_background_mtrl_mult.9.png ERROR: Unable to open PNG file
AAPT err(Facade for 643662806) : No Delegate set : lost message:\?\C:\Windows\System32\config\systemprofile.gradle\caches\transforms-1\files-1.1\appcompat-v7-25.4.0.aar\22f7ec1a0038dffd28e74c123c86377c\res\drawable-xhdpi-v4\abc_btn_switch_to_on_mtrl_00012.9.png ERROR: Unable to open PNG file
AAPT err(Facade for 643662806) : No Delegate set : lost message:\?\C:\Windows\System32\config\systemprofile.gradle\caches\transforms-1\files-1.1\appcompat-v7-25.4.0.aar\22f7ec1a0038dffd28e74c123c86377c\res\drawable-xxhdpi-v4\abc_scrubber_track_mtrl_alpha.9.png ERROR: Unable to open PNG file
AAPT err(Facade for 643662806) : No Delegate set : lost message:\?\C:\Windows\System32\config\systemprofile.gradle\caches\transforms-1\files-1.1\appcompat-v7-25.4.0.aar\22f7ec1a0038dffd28e74c123c86377c\res\drawable-ldrtl-xxhdpi-v17\abc_spinner_mtrl_am_alpha.9.png ERROR: Unable to open PNG file
AAPT err(Facade for 643662806) : No Delegate set : lost message:\?\C:\Windows\System32\config\systemprofile.gradle\caches\transforms-1\files-1.1\appcompat-v7-25.4.0.aar\22f7ec1a0038dffd28e74c123c86377c\res\drawable-xhdpi-v4\abc_btn_switch_to_on_mtrl_00001.9.png ERROR: Unable to open PNG file
AAPT err(Facade for 643662806) : No Delegate set : lost message:\?\C:\Windows\System32\config\systemprofile.gradle\caches\transforms-1\files-1.1\appcompat-v7-25.4.0.aar\22f7ec1a0038dffd28e74c123c86377c\res\drawable-hdpi-v4\abc_spinner_mtrl_am_alpha.9.png ERROR: Unable to open PNG file
AAPT err(Facade for 643662806) : No Delegate set : lost message:\?\C:\Windows\System32\config\systemprofile.gradle\caches\transforms-1\files-1.1\appcompat-v7-25.4.0.aar\22f7ec1a0038dffd28e74c123c86377c\res\drawable-xhdpi-v4\abc_scrubber_primary_mtrl_alpha.9.png ERROR: Unable to open PNG file
AAPT err(Facade for 643662806) : No Delegate set : lost message:\?\C:\Windows\System32\config\systemprofile.gradle\caches\transforms-1\files-1.1\appcompat-v7-25.4.0.aar\22f7ec1a0038dffd28e74c123c86377c\res\drawable-xhdpi-v4\abc_spinner_mtrl_am_alpha.9.png ERROR: Unable to open PNG file
AAPT err(Facade for 643662806) : No Delegate set : lost message:\?\C:\Windows\System32\config\systemprofile.gradle\caches\transforms-1\files-1.1\appcompat-v7-25.4.0.aar\22f7ec1a0038dffd28e74c123c86377c\res\drawable-hdpi-v4\abc_popup_background_mtrl_mult.9.png ERROR: Unable to open PNG file
AAPT err(Facade for 643662806) : No Delegate set : lost message:\?\C:\Windows\System32\config\systemprofile.gradle\caches\transforms-1\files-1.1\appcompat-v7-25.4.0.aar\22f7ec1a0038dffd28e74c123c86377c\res\drawable-ldrtl-hdpi-v17\abc_spinner_mtrl_am_alpha.9.png ERROR: Unable to open PNG file
AAPT err(Facade for 643662806) : No Delegate set : lost message:\?\C:\Windows\System32\config\systemprofile.gradle\caches\transforms-1\files-1.1\appcompat-v7-25.4.0.aar\22f7ec1a0038dffd28e74c123c86377c\res\drawable-ldrtl-mdpi-v17\abc_spinner_mtrl_am_alpha.9.png ERROR: Unable to open PNG file
AAPT err(Facade for 643662806) : No Delegate set : lost message:\?\C:\Windows\System32\config\systemprofile.gradle\caches\transforms-1\files-1.1\appcompat-v7-25.4.0.aar\22f7ec1a0038dffd28e74c123c86377c\res\drawable-hdpi-v4\abc_textfield_search_default_mtrl_alpha.9.png ERROR: Unable to open PNG file
AAPT err(Facade for 643662806) : No Delegate set : lost message:\?\C:\Windows\System32\config\systemprofile.gradle\caches\transforms-1\files-1.1\appcompat-v7-25.4.0.aar\22f7ec1a0038dffd28e74c123c86377c\res\drawable-hdpi-v4\notification_bg_normal_pressed.9.png ERROR: Unable to open PNG file
AAPT err(Facade for 643662806) : No Delegate set : lost message:\?\C:\Windows\System32\config\systemprofile.gradle\caches\transforms-1\files-1.1\appcompat-v7-25.4.0.aar\22f7ec1a0038dffd28e74c123c86377c\res\drawable-hdpi-v4\abc_list_selector_disabled_holo_dark.9.png ERROR: Unable to open PNG file
AAPT err(Facade for 643662806) : No Delegate set : lost message:\?\C:\Windows\System32\config\systemprofile.gradle\caches\transforms-1\files-1.1\appcompat-v7-25.4.0.aar\22f7ec1a0038dffd28e74c123c86377c\res\drawable-mdpi-v4\abc_list_selector_disabled_holo_light.9.png ERROR: Unable to open PNG file
AAPT err(Facade for 643662806) : No Delegate set : lost message:\?\C:\Windows\System32\config\systemprofile.gradle\caches\transforms-1\files-1.1\appcompat-v7-25.4.0.aar\22f7ec1a0038dffd28e74c123c86377c\res\drawable-hdpi-v4\abc_list_longpressed_holo.9.png ERROR: Unable to open PNG file
AAPT err(Facade for 643662806) : No Delegate set : lost message:\?\C:\Windows\System32\config\systemprofile.gradle\caches\transforms-1\files-1.1\appcompat-v7-25.4.0.aar\22f7ec1a0038dffd28e74c123c86377c\res\drawable-xxhdpi-v4\abc_textfield_activated_mtrl_alpha.9.png ERROR: Unable to open PNG file
AAPT err(Facade for 643662806): \?\C:\Windows\System32\config\systemprofile.gradle\caches\transforms-1\files-1.1\appcompat-v7-25.4.0.aar\22f7ec1a0038dffd28e74c123c86377c\res\drawable-xxhdpi-v4\abc_btn_switch_to_on_mtrl_00001.9.png ERROR: Unable to open PNG file
AAPT err(Facade for 1882293727): \?\C:\Windows\System32\config\systemprofile.gradle\caches\transforms-1\files-1.1\appcompat-v7-25.4.0.aar\22f7ec1a0038dffd28e74c123c86377c\res\drawable-xhdpi-v4\abc_textfield_search_activated_mtrl_alpha.9.png ERROR: Unable to open PNG file
AAPT err(Facade for 643662806): \?\C:\Windows\System32\config\systemprofile.gradle\caches\transforms-1\files-1.1\appcompat-v7-25.4.0.aar\22f7ec1a0038dffd28e74c123c86377c\res\drawable-xxhdpi-v4\abc_btn_switch_to_on_mtrl_00012.9.png ERROR: Unable to open PNG file
AAPT err(Facade for 1109706098): \?\C:\Windows\System32\config\systemprofile.gradle\caches\transforms-1\files-1.1\appcompat-v7-25.4.0.aar\22f7ec1a0038dffd28e74c123c86377c\res\drawable-xhdpi-v4\abc_list_pressed_holo_dark.9.png ERROR: Unable to open PNG file
AAPT err(Facade for 1475354704): \?\C:\Windows\System32\config\systemprofile.gradle\caches\transforms-1\files-1.1\appcompat-v7-25.4.0.aar\22f7ec1a0038dffd28e74c123c86377c\res\drawable-xhdpi-v4\abc_popup_background_mtrl_mult.9.png ERROR: Unable to open PNG file
AAPT err(Facade for 1031818146): \?\C:\Windows\System32\config\systemprofile.gradle\caches\transforms-1\files-1.1\appcompat-v7-25.4.0.aar\22f7ec1a0038dffd28e74c123c86377c\res\drawable-xxxhdpi-v4\abc_tab_indicator_mtrl_alpha.9.png ERROR: Unable to open PNG file
AAPT err(Facade for 1031818146): \?\C:\Windows\System32\config\systemprofile.gradle\caches\transforms-1\files-1.1\appcompat-v7-25.4.0.aar\22f7ec1a0038dffd28e74c123c86377c\res\drawable-xxhdpi-v4\abc_spinner_mtrl_am_alpha.9.png ERROR: Unable to open PNG file
AAPT err(Facade for 1140561222): \?\C:\Windows\System32\config\systemprofile.gradle\caches\transforms-1\files-1.1\appcompat-v7-25.4.0.aar\22f7ec1a0038dffd28e74c123c86377c\res\drawable-xxhdpi-v4\abc_list_selector_disabled_holo_dark.9.png ERROR: Unable to open PNG file
AAPT err(Facade for 196028946): \?\C:\Windows\System32\config\systemprofile.gradle\caches\transforms-1\files-1.1\appcompat-v7-25.4.0.aar\22f7ec1a0038dffd28e74c123c86377c\res\drawable-mdpi-v4\abc_spinner_mtrl_am_alpha.9.png ERROR: Unable to open PNG file
AAPT err(Facade for 1140561222): \?\C:\Windows\System32\config\systemprofile.gradle\caches\transforms-1\files-1.1\appcompat-v7-25.4.0.aar\22f7ec1a0038dffd28e74c123c86377c\res\drawable-hdpi-v4\abc_btn_switch_to_on_mtrl_00012.9.png ERROR: Unable to open PNG file
AAPT err(Facade for 196028946): \?\C:\Windows\System32\config\systemprofile.gradle\caches\transforms-1\files-1.1\appcompat-v7-25.4.0.aar\22f7ec1a0038dffd28e74c123c86377c\res\drawable-mdpi-v4\abc_btn_switch_to_on_mtrl_00012.9.png ERROR: Unable to open PNG file
AAPT err(Facade for 1031818146): \?\C:\Windows\System32\config\systemprofile.gradle\caches\transforms-1\files-1.1\appcompat-v7-25.4.0.aar\22f7ec1a0038dffd28e74c123c86377c\res\drawable-mdpi-v4\notification_bg_normal.9.png ERROR: Unable to open PNG file
AAPT err(Facade for 1031818146): \?\C:\Windows\System32\config\systemprofile.gradle\caches\transforms-1\files-1.1\appcompat-v7-25.4.0.aar\22f7ec1a0038dffd28e74c123c86377c\res\drawable-xxhdpi-v4\abc_list_pressed_holo_dark.9.png ERROR: Unable to open PNG file
AAPT err(Facade for 1475354704): \?\C:\Windows\System32\config\systemprofile.gradle\caches\transforms-1\files-1.1\appcompat-v7-25.4.0.aar\22f7ec1a0038dffd28e74c123c86377c\res\drawable-hdpi-v4\abc_ab_share_pack_mtrl_alpha.9.png ERROR: Unable to open PNG file
AAPT err(Facade for 860633955): \?\C:\Windows\System32\config\systemprofile.gradle\caches\transforms-1\files-1.1\appcompat-v7-25.4.0.aar\22f7ec1a0038dffd28e74c123c86377c\res\drawable-xhdpi-v4\abc_list_divider_mtrl_alpha.9.png ERROR: Unable to open PNG file
AAPT err(Facade for 1109706098): \?\C:\Windows\System32\config\systemprofile.gradle\caches\transforms-1\files-1.1\appcompat-v7-25.4.0.aar\22f7ec1a0038dffd28e74c123c86377c\res\drawable-hdpi-v4\abc_btn_switch_to_on_mtrl_00001.9.png ERROR: Unable to open PNG file
AAPT err(Facade for 643662806): \?\C:\Windows\System32\config\systemprofile.gradle\caches\transforms-1\files-1.1\appcompat-v7-25.4.0.aar\22f7ec1a0038dffd28e74c123c86377c\res\drawable-hdpi-v4\abc_list_focused_holo.9.png ERROR: Unable to open PNG file
AAPT err(Facade for 1882293727): \?\C:\Windows\System32\config\systemprofile.gradle\caches\transforms-1\files-1.1\appcompat-v7-25.4.0.aar\22f7ec1a0038dffd28e74c123c86377c\res\drawable-hdpi-v4\abc_list_pressed_holo_dark.9.png ERROR: Unable to open PNG file
AAPT err(Facade for 643662806): \?\C:\Windows\System32\config\systemprofile.gradle\caches\transforms-1\files-1.1\appcompat-v7-25.4.0.aar\22f7ec1a0038dffd28e74c123c86377c\res\drawable-xxhdpi-v4\abc_list_selector_disabled_holo_light.9.png ERROR: Unable to open PNG file
AAPT err(Facade for 643662806): \?\C:\Windows\System32\config\systemprofile.gradle\caches\transforms-1\files-1.1\appcompat-v7-25.4.0.aar\22f7ec1a0038dffd28e74c123c86377c\res\drawable-mdpi-v4\abc_list_pressed_holo_dark.9.png ERROR: Unable to open PNG file
AAPT err(Facade for 643662806): \?\C:\Windows\System32\config\systemprofile.gradle\caches\transforms-1\files-1.1\appcompat-v7-25.4.0.aar\22f7ec1a0038dffd28e74c123c86377c\res\drawable-hdpi-v4\abc_textfield_search_activated_mtrl_alpha.9.png ERROR: Unable to open PNG file
AAPT err(Facade for 1109706098): \?\C:\Windows\System32\config\systemprofile.gradle\caches\transforms-1\files-1.1\appcompat-v7-25.4.0.aar\22f7ec1a0038dffd28e74c123c86377c\res\drawable-hdpi-v4\notification_bg_low_normal.9.png ERROR: Unable to open PNG file
AAPT err(Facade for 860633955): \?\C:\Windows\System32\config\systemprofile.gradle\caches\transforms-1\files-1.1\appcompat-v7-25.4.0.aar\22f7ec1a0038dffd28e74c123c86377c\res\drawable-hdpi-v4\abc_menu_hardkey_panel_mtrl_mult.9.png ERROR: Unable to open PNG file
AAPT err(Facade for 1475354704): \?\C:\Windows\System32\config\systemprofile.gradle\caches\transforms-1\files-1.1\appcompat-v7-25.4.0.aar\22f7ec1a0038dffd28e74c123c86377c\res\drawable-xhdpi-v4\abc_list_selector_disabled_holo_light.9.png ERROR: Unable to open PNG file
AAPT err(Facade for 1031818146): \?\C:\Windows\System32\config\systemprofile.gradle\caches\transforms-1\files-1.1\appcompat-v7-25.4.0.aar\22f7ec1a0038dffd28e74c123c86377c\res\drawable-mdpi-v4\notification_bg_normal_pressed.9.png ERROR: Unable to open PNG file
AAPT err(Facade for 196028946): \?\C:\Windows\System32\config\systemprofile.gradle\caches\transforms-1\files-1.1\appcompat-v7-25.4.0.aar\22f7ec1a0038dffd28e74c123c86377c\res\drawable-hdpi-v4\notification_bg_low_pressed.9.png ERROR: Unable to open PNG file
AAPT err(Facade for 1140561222): \?\C:\Windows\System32\config\systemprofile.gradle\caches\transforms-1\files-1.1\appcompat-v7-25.4.0.aar\22f7ec1a0038dffd28e74c123c86377c\res\drawable-xhdpi-v4\notification_bg_low_normal.9.png ERROR: Unable to open PNG file
AAPT err(Facade for 196028946): \?\C:\Windows\System32\config\systemprofile.gradle\caches\transforms-1\files-1.1\appcompat-v7-25.4.0.aar\22f7ec1a0038dffd28e74c123c86377c\res\drawable-xhdpi-v4\abc_scrubber_track_mtrl_alpha.9.png ERROR: Unable to open PNG file
AAPT err(Facade for 1031818146): \?\C:\Windows\System32\config\systemprofile.gradle\caches\transforms-1\files-1.1\appcompat-v7-25.4.0.aar\22f7ec1a0038dffd28e74c123c86377c\res\drawable-xxhdpi-v4\abc_switch_track_mtrl_alpha.9.png ERROR: Unable to open PNG file
AAPT err(Facade for 1475354704): \?\C:\Windows\System32\config\systemprofile.gradle\caches\transforms-1\files-1.1\appcompat-v7-25.4.0.aar\22f7ec1a0038dffd28e74c123c86377c\res\drawable-mdpi-v4\abc_textfield_search_default_mtrl_alpha.9.png ERROR: Unable to open PNG file
AAPT err(Facade for 860633955): \?\C:\Windows\System32\config\systemprofile.gradle\caches\transforms-1\files-1.1\appcompat-v7-25.4.0.aar\22f7ec1a0038dffd28e74c123c86377c\res\drawable-mdpi-v4\abc_textfield_search_activated_mtrl_alpha.9.png ERROR: Unable to open PNG file
AAPT err(Facade for 860633955): \?\C:\Windows\System32\config\systemprofile.gradle\caches\transforms-1\files-1.1\appcompat-v7-25.4.0.aar\22f7ec1a0038dffd28e74c123c86377c\res\drawable-hdpi-v4\abc_scrubber_track_mtrl_alpha.9.png ERROR: Unable to open PNG file
AAPT err(Facade for 1109706098): \?\C:\Windows\System32\config\systemprofile.gradle\caches\transforms-1\files-1.1\appcompat-v7-25.4.0.aar\22f7ec1a0038dffd28e74c123c86377c\res\drawable-mdpi-v4\abc_switch_track_mtrl_alpha.9.png ERROR: Unable to open PNG file
AAPT err(Facade for 643662806): \?\C:\Windows\System32\config\systemprofile.gradle\caches\transforms-1\files-1.1\appcompat-v7-25.4.0.aar\22f7ec1a0038dffd28e74c123c86377c\res\drawable-mdpi-v4\abc_menu_hardkey_panel_mtrl_mult.9.png ERROR: Unable to open PNG file
AAPT err(Facade for 1882293727): \?\C:\Windows\System32\config\systemprofile.gradle\caches\transforms-1\files-1.1\appcompat-v7-25.4.0.aar\22f7ec1a0038dffd28e74c123c86377c\res\drawable-xxhdpi-v4\abc_list_divider_mtrl_alpha.9.png ERROR: Unable to open PNG file
AAPT err(Facade for 643662806): \?\C:\Windows\System32\config\systemprofile.gradle\caches\transforms-1\files-1.1\appcompat-v7-25.4.0.aar\22f7ec1a0038dffd28e74c123c86377c\res\drawable-mdpi-v4\abc_list_pressed_holo_light.9.png ERROR: Unable to open PNG file
AAPT err(Facade for 1109706098): \?\C:\Windows\System32\config\systemprofile.gradle\caches\transforms-1\files-1.1\appcompat-v7-25.4.0.aar\22f7ec1a0038dffd28e74c123c86377c\res\drawable-xxhdpi-v4\abc_ab_share_pack_mtrl_alpha.9.png ERROR: Unable to open PNG file
AAPT err(Facade for 860633955): \?\C:\Windows\System32\config\systemprofile.gradle\caches\transforms-1\files-1.1\appcompat-v7-25.4.0.aar\22f7ec1a0038dffd28e74c123c86377c\res\drawable-mdpi-v4\abc_ab_share_pack_mtrl_alpha.9.png ERROR: Unable to open PNG file
AAPT err(Facade for 1475354704): \?\C:\Windows\System32\config\systemprofile.gradle\caches\transforms-1\files-1.1\appcompat-v7-25.4.0.aar\22f7ec1a0038dffd28e74c123c86377c\res\drawable-xhdpi-v4\abc_switch_track_mtrl_alpha.9.png ERROR: Unable to open PNG file
AAPT err(Facade for 1031818146): \?\C:\Windows\System32\config\systemprofile.gradle\caches\transforms-1\files-1.1\appcompat-v7-25.4.0.aar\22f7ec1a0038dffd28e74c123c86377c\res\drawable-xxhdpi-v4\abc_textfield_search_activated_mtrl_alpha.9.png ERROR: Unable to open PNG file
AAPT err(Facade for 196028946): \?\C:\Windows\System32\config\systemprofile.gradle\caches\transforms-1\files-1.1\appcompat-v7-25.4.0.aar\22f7ec1a0038dffd28e74c123c86377c\res\drawable-xxhdpi-v4\abc_list_pressed_holo_light.9.png ERROR: Unable to open PNG file
AAPT err(Facade for 1140561222): \?\C:\Windows\System32\config\systemprofile.gradle\caches\transforms-1\files-1.1\appcompat-v7-25.4.0.aar\22f7ec1a0038dffd28e74c123c86377c\res\drawable-xxhdpi-v4\abc_list_longpressed_holo.9.png ERROR: Unable to open PNG file
AAPT err(Facade for 196028946): \?\C:\Windows\System32\config\systemprofile.gradle\caches\transforms-1\files-1.1\appcompat-v7-25.4.0.aar\22f7ec1a0038dffd28e74c123c86377c\res\drawable-xxxhdpi-v4\abc_btn_switch_to_on_mtrl_00001.9.png ERROR: Unable to open PNG file
AAPT err(Facade for 1031818146): \?\C:\Windows\System32\config\systemprofile.gradle\caches\transforms-1\files-1.1\appcompat-v7-25.4.0.aar\22f7ec1a0038dffd28e74c123c86377c\res\drawable-xxxhdpi-v4\abc_btn_switch_to_on_mtrl_00012.9.png ERROR: Unable to open PNG file
AAPT err(Facade for 1475354704): \?\C:\Windows\System32\config\systemprofile.gradle\caches\transforms-1\files-1.1\appcompat-v7-25.4.0.aar\22f7ec1a0038dffd28e74c123c86377c\res\drawable-xxhdpi-v4\abc_list_focused_holo.9.png ERROR: Unable to open PNG file
AAPT err(Facade for 860633955): \?\C:\Windows\System32\config\systemprofile.gradle\caches\transforms-1\files-1.1\appcompat-v7-25.4.0.aar\22f7ec1a0038dffd28e74c123c86377c\res\drawable-xxhdpi-v4\abc_scrubber_primary_mtrl_alpha.9.png ERROR: Unable to open PNG file
AAPT err(Facade for 643662806): \?\C:\Windows\System32\config\systemprofile.gradle\caches\transforms-1\files-1.1\appcompat-v7-25.4.0.aar\22f7ec1a0038dffd28e74c123c86377c\res\drawable-xhdpi-v4\abc_textfield_activated_mtrl_alpha.9.png ERROR: Unable to open PNG file
AAPT err(Facade for 1882293727): \?\C:\Windows\System32\config\systemprofile.gradle\caches\transforms-1\files-1.1\appcompat-v7-25.4.0.aar\22f7ec1a0038dffd28e74c123c86377c\res\drawable-mdpi-v4\abc_tab_indicator_mtrl_alpha.9.png ERROR: Unable to open PNG file
AAPT err(Facade for 643662806): \?\C:\Windows\System32\config\systemprofile.gradle\caches\transforms-1\files-1.1\appcompat-v7-25.4.0.aar\22f7ec1a0038dffd28e74c123c86377c\res\drawable-ldrtl-xxxhdpi-v17\abc_spinner_mtrl_am_alpha.9.png ERROR: Unable to open PNG file
AAPT err(Facade for 860633955): \?\C:\Windows\System32\config\systemprofile.gradle\caches\transforms-1\files-1.1\appcompat-v7-25.4.0.aar\22f7ec1a0038dffd28e74c123c86377c\res\drawable-mdpi-v4\abc_list_selector_disabled_holo_dark.9.png ERROR: Unable to open PNG file
AAPT err(Facade for 1475354704): \?\C:\Windows\System32\config\systemprofile.gradle\caches\transforms-1\files-1.1\appcompat-v7-25.4.0.aar\22f7ec1a0038dffd28e74c123c86377c\res\drawable-hdpi-v4\abc_cab_background_top_mtrl_alpha.9.png ERROR: Unable to open PNG file
AAPT err(Facade for 1140561222): \?\C:\Windows\System32\config\systemprofile.gradle\caches\transforms-1\files-1.1\appcompat-v7-25.4.0.aar\22f7ec1a0038dffd28e74c123c86377c\res\drawable-xhdpi-v4\abc_menu_hardkey_panel_mtrl_mult.9.png ERROR: Unable to open PNG file
AAPT err(Facade for 1475354704): \?\C:\Windows\System32\config\systemprofile.gradle\caches\transforms-1\files-1.1\appcompat-v7-25.4.0.aar\22f7ec1a0038dffd28e74c123c86377c\res\drawable-mdpi-v4\abc_list_divider_mtrl_alpha.9.png ERROR: Unable to open PNG file
AAPT err(Facade for 860633955): \?\C:\Windows\System32\config\systemprofile.gradle\caches\transforms-1\files-1.1\appcompat-v7-25.4.0.aar\22f7ec1a0038dffd28e74c123c86377c\res\drawable-xxxhdpi-v4\abc_switch_track_mtrl_alpha.9.png ERROR: Unable to open PNG file
AAPT err(Facade for 643662806): \?\C:\Windows\System32\config\systemprofile.gradle\caches\transforms-1\files-1.1\appcompat-v7-25.4.0.aar\22f7ec1a0038dffd28e74c123c86377c\res\drawable-hdpi-v4\abc_list_selector_disabled_holo_light.9.png ERROR: Unable to open PNG file
AAPT err(Facade for 1882293727): \?\C:\Windows\System32\config\systemprofile.gradle\caches\transforms-1\files-1.1\appcompat-v7-25.4.0.aar\22f7ec1a0038dffd28e74c123c86377c\res\drawable-mdpi-v4\abc_cab_background_top_mtrl_alpha.9.png ERROR: Unable to open PNG file
AAPT err(Facade for 643662806): \?\C:\Windows\System32\config\systemprofile.gradle\caches\transforms-1\files-1.1\appcompat-v7-25.4.0.aar\22f7ec1a0038dffd28e74c123c86377c\res\drawable-mdpi-v4\abc_list_longpressed_holo.9.png ERROR: Unable to open PNG file
AAPT err(Facade for 860633955): \?\C:\Windows\System32\config\systemprofile.gradle\caches\transforms-1\files-1.1\appcompat-v7-25.4.0.aar\22f7ec1a0038dffd28e74c123c86377c\res\drawable-xxhdpi-v4\abc_textfield_search_default_mtrl_alpha.9.png ERROR: Unable to open PNG file
AAPT err(Facade for 1475354704): \?\C:\Windows\System32\config\systemprofile.gradle\caches\transforms-1\files-1.1\appcompat-v7-25.4.0.aar\22f7ec1a0038dffd28e74c123c86377c\res\drawable-hdpi-v4\abc_textfield_activated_mtrl_alpha.9.png ERROR: Unable to open PNG file
AAPT err(Facade for 860633955): \?\C:\Windows\System32\config\systemprofile.gradle\caches\transforms-1\files-1.1\appcompat-v7-25.4.0.aar\22f7ec1a0038dffd28e74c123c86377c\res\drawable-mdpi-v4\abc_textfield_activated_mtrl_alpha.9.png ERROR: Unable to open PNG file
AAPT err(Facade for 1882293727): \?\C:\Windows\System32\config\systemprofile.gradle\caches\transforms-1\files-1.1\appcompat-v7-25.4.0.aar\22f7ec1a0038dffd28e74c123c86377c\res\drawable-hdpi-v4\abc_scrubber_primary_mtrl_alpha.9.png ERROR: Unable to open PNG file
AAPT err(Facade for 1475354704): \?\C:\Windows\System32\config\systemprofile.gradle\caches\transforms-1\files-1.1\appcompat-v7-25.4.0.aar\22f7ec1a0038dffd28e74c123c86377c\res\drawable-xhdpi-v4\abc_ab_share_pack_mtrl_alpha.9.png ERROR: Unable to open PNG file
AAPT err(Facade for 1882293727): \?\C:\Windows\System32\config\systemprofile.gradle\caches\transforms-1\files-1.1\appcompat-v7-25.4.0.aar\22f7ec1a0038dffd28e74c123c86377c\res\drawable-xhdpi-v4\notification_bg_normal_pressed.9.png ERROR: Unable to open PNG file
AAPT err(Facade for 1475354704): \?\C:\Windows\System32\config\systemprofile.gradle\caches\transforms-1\files-1.1\appcompat-v7-25.4.0.aar\22f7ec1a0038dffd28e74c123c86377c\res\drawable-xhdpi-v4\abc_list_pressed_holo_light.9.png ERROR: Unable to open PNG file
AAPT err(Facade for 1882293727): \?\C:\Windows\System32\config\systemprofile.gradle\caches\transforms-1\files-1.1\appcompat-v7-25.4.0.aar\22f7ec1a0038dffd28e74c123c86377c\res\drawable-hdpi-v4\notification_bg_normal.9.png ERROR: Unable to open PNG file
AAPT err(Facade for 1882293727): \?\C:\Windows\System32\config\systemprofile.gradle\caches\transforms-1\files-1.1\appcompat-v7-25.4.0.aar\22f7ec1a0038dffd28e74c123c86377c\res\drawable-xxhdpi-v4\abc_textfield_default_mtrl_alpha.9.png ERROR: Unable to open PNG file
AAPT err(Facade for 1475354704): \?\C:\Windows\System32\config\systemprofile.gradle\caches\transforms-1\files-1.1\appcompat-v7-25.4.0.aar\22f7ec1a0038dffd28e74c123c86377c\res\drawable-mdpi-v4\abc_list_focused_holo.9.png ERROR: Unable to open PNG file
AAPT err(Facade for 1882293727): \?\C:\Windows\System32\config\systemprofile.gradle\caches\transforms-1\files-1.1\appcompat-v7-25.4.0.aar\22f7ec1a0038dffd28e74c123c86377c\res\drawable-hdpi-v4\abc_switch_track_mtrl_alpha.9.png ERROR: Unable to open PNG file
AAPT err(Facade for 1882293727): \?\C:\Windows\System32\config\systemprofile.gradle\caches\transforms-1\files-1.1\appcompat-v7-25.4.0.aar\22f7ec1a0038dffd28e74c123c86377c\res\drawable-ldrtl-xhdpi-v17\abc_spinner_mtrl_am_alpha.9.png ERROR: Unable to open PNG file
AAPT err(Facade for 1882293727): \?\C:\Windows\System32\config\systemprofile.gradle\caches\transforms-1\files-1.1\appcompat-v7-25.4.0.aar\22f7ec1a0038dffd28e74c123c86377c\res\drawable-mdpi-v4\abc_textfield_default_mtrl_alpha.9.png ERROR: Unable to open PNG file
AAPT err(Facade for 1882293727): \?\C:\Windows\System32\config\systemprofile.gradle\caches\transforms-1\files-1.1\appcompat-v7-25.4.0.aar\22f7ec1a0038dffd28e74c123c86377c\res\drawable-hdpi-v4\abc_textfield_default_mtrl_alpha.9.png ERROR: Unable to open PNG file
AAPT err(Facade for 1882293727): \?\C:\Windows\System32\config\systemprofile.gradle\caches\transforms-1\files-1.1\appcompat-v7-25.4.0.aar\22f7ec1a0038dffd28e74c123c86377c\res\drawable-mdpi-v4\abc_btn_switch_to_on_mtrl_00001.9.png ERROR: Unable to open PNG file
AAPT err(Facade for 1882293727): \?\C:\Windows\System32\config\systemprofile.gradle\caches\transforms-1\files-1.1\appcompat-v7-25.4.0.aar\22f7ec1a0038dffd28e74c123c86377c\res\drawable-xxhdpi-v4\abc_menu_hardkey_panel_mtrl_mult.9.png ERROR: Unable to open PNG file
AAPT err(Facade for 1882293727): \?\C:\Windows\System32\config\systemprofile.gradle\caches\transforms-1\files-1.1\appcompat-v7-25.4.0.aar\22f7ec1a0038dffd28e74c123c86377c\res\drawable-xxxhdpi-v4\abc_spinner_mtrl_am_alpha.9.png ERROR: Unable to open PNG file
AAPT err(Facade for 1882293727): \?\C:\Windows\System32\config\systemprofile.gradle\caches\transforms-1\files-1.1\appcompat-v7-25.4.0.aar\22f7ec1a0038dffd28e74c123c86377c\res\drawable-mdpi-v4\abc_scrubber_track_mtrl_alpha.9.png ERROR: Unable to open PNG file

Error: java.util.concurrent.ExecutionException: com.android.tools.aapt2.Aapt2Exception: AAPT error: check logs for details
:app:mergeWandoujiaDebugResources FAILED

FAILURE: Build failed with an exception.

  • What went wrong:
    Execution failed for task ‘:app:mergeWandoujiaDebugResources’.

Error: java.util.concurrent.ExecutionException: com.android.tools.aapt2.Aapt2Exception: AAPT error: check logs for details

  • Try:
    Run with --stacktrace option to get the stack trace. Run with --info or --debug option to get more log output.

  • Get more help at https://help.gradle.org

BUILD FAILED in 9s
68 actionable tasks: 61 executed, 7 up-to-date
Build step ‘Invoke Gradle script’ changed build result to FAILURE
Build step ‘Invoke Gradle script’ marked build as failure
Archiving artifacts
Finished: FAILURE