JDK 9 build failures on Windows


(Pepone Onrez) #1

I testing JDK 9 for a project with gradle 4.1 I getting this error on Windows

:test:compileJava (Thread[Task worker for ':' Thread 7,5,main]) completed. Took 1.299 secs.

FAILURE: Build failed with an exception.

* What went wrong:
Execution failed for task ':test:compileJava'.
> java.lang.reflect.UndeclaredThrowableException

* Try:
Run with --debug option to get more log output.

* Exception is:
org.gradle.api.tasks.TaskExecutionException: Execution failed for task ':test:compileJava'.
        at org.gradle.api.internal.tasks.execution.ExecuteActionsTaskExecuter.executeActions(ExecuteActionsTaskExecuter.java:100)
        at org.gradle.api.internal.tasks.execution.ExecuteActionsTaskExecuter.execute(ExecuteActionsTaskExecuter.java:70)
        at org.gradle.api.internal.tasks.execution.SkipUpToDateTaskExecuter.execute(SkipUpToDateTaskExecuter.java:63)
        at org.gradle.api.internal.tasks.execution.ResolveTaskOutputCachingStateExecuter.execute(ResolveTaskOutputCachingStateExecuter.java:54)
        at org.gradle.api.internal.tasks.execution.ValidatingTaskExecuter.execute(ValidatingTaskExecuter.java:58)
        at org.gradle.api.internal.tasks.execution.SkipEmptySourceFilesTaskExecuter.execute(SkipEmptySourceFilesTaskExecuter.java:88)
        at org.gradle.api.internal.tasks.execution.ResolveTaskArtifactStateTaskExecuter.execute(ResolveTaskArtifactStateTaskExecuter.java:52)
        at org.gradle.api.internal.tasks.execution.SkipTaskWithNoActionsExecuter.execute(SkipTaskWithNoActionsExecuter.java:52)
        at org.gradle.api.internal.tasks.execution.SkipOnlyIfTaskExecuter.execute(SkipOnlyIfTaskExecuter.java:54)
        at org.gradle.api.internal.tasks.execution.ExecuteAtMostOnceTaskExecuter.execute(ExecuteAtMostOnceTaskExecuter.java:43)
        at org.gradle.api.internal.tasks.execution.CatchExceptionTaskExecuter.execute(CatchExceptionTaskExecuter.java:34)
        at org.gradle.execution.taskgraph.DefaultTaskGraphExecuter$EventFiringTaskWorker$1.run(DefaultTaskGraphExecuter.java:248)
        at org.gradle.internal.progress.DefaultBuildOperationExecutor$RunnableBuildOperationWorker.execute(DefaultBuildOperationExecutor.java:336)
        at org.gradle.internal.progress.DefaultBuildOperationExecutor$RunnableBuildOperationWorker.execute(DefaultBuildOperationExecutor.java:328)
        at org.gradle.internal.progress.DefaultBuildOperationExecutor.execute(DefaultBuildOperationExecutor.java:197)
        at org.gradle.internal.progress.DefaultBuildOperationExecutor.run(DefaultBuildOperationExecutor.java:107)
        at org.gradle.execution.taskgraph.DefaultTaskGraphExecuter$EventFiringTaskWorker.execute(DefaultTaskGraphExecuter.java:241)
        at org.gradle.execution.taskgraph.DefaultTaskGraphExecuter$EventFiringTaskWorker.execute(DefaultTaskGraphExecuter.java:230)
        at org.gradle.execution.taskgraph.DefaultTaskPlanExecutor$TaskExecutorWorker.processTask(DefaultTaskPlanExecutor.java:124)
        at org.gradle.execution.taskgraph.DefaultTaskPlanExecutor$TaskExecutorWorker.access$200(DefaultTaskPlanExecutor.java:80)
        at org.gradle.execution.taskgraph.DefaultTaskPlanExecutor$TaskExecutorWorker$1.execute(DefaultTaskPlanExecutor.java:105)
        at org.gradle.execution.taskgraph.DefaultTaskPlanExecutor$TaskExecutorWorker$1.execute(DefaultTaskPlanExecutor.java:99)
        at org.gradle.execution.taskgraph.DefaultTaskExecutionPlan.execute(DefaultTaskExecutionPlan.java:625)
        at org.gradle.execution.taskgraph.DefaultTaskExecutionPlan.executeWithTask(DefaultTaskExecutionPlan.java:580)
        at org.gradle.execution.taskgraph.DefaultTaskPlanExecutor$TaskExecutorWorker.run(DefaultTaskPlanExecutor.java:99)
        at org.gradle.internal.concurrent.ExecutorPolicy$CatchAndRecordFailures.onExecute(ExecutorPolicy.java:63)
        at org.gradle.internal.concurrent.ManagedExecutorImpl$1.run(ManagedExecutorImpl.java:46)
        at org.gradle.internal.concurrent.ThreadFactoryImpl$ManagedThreadRunnable.run(ThreadFactoryImpl.java:55)
Caused by: java.lang.RuntimeException: java.lang.reflect.UndeclaredThrowableException
        at jdk.compiler/com.sun.tools.javac.api.JavacTool.getTask(JavacTool.java:198)
        at jdk.compiler/com.sun.tools.javac.api.JavacTool.getTask(JavacTool.java:119)
        at jdk.compiler/com.sun.tools.javac.api.JavacTool.getTask(JavacTool.java:68)
        at org.gradle.api.internal.tasks.compile.JdkJavaCompiler.createCompileTask(JdkJavaCompiler.java:67)
        at org.gradle.api.internal.tasks.compile.JdkJavaCompiler.execute(JdkJavaCompiler.java:48)
        at org.gradle.api.internal.tasks.compile.JdkJavaCompiler.execute(JdkJavaCompiler.java:36)
        at org.gradle.api.internal.tasks.compile.NormalizingJavaCompiler.delegateAndHandleErrors(NormalizingJavaCompiler.java:99)
        at org.gradle.api.internal.tasks.compile.NormalizingJavaCompiler.execute(NormalizingJavaCompiler.java:52)
        at org.gradle.api.internal.tasks.compile.NormalizingJavaCompiler.execute(NormalizingJavaCompiler.java:37)
        at org.gradle.api.internal.tasks.compile.CleaningJavaCompilerSupport.execute(CleaningJavaCompilerSupport.java:35)
        at org.gradle.api.internal.tasks.compile.CleaningJavaCompilerSupport.execute(CleaningJavaCompilerSupport.java:25)
        at org.gradle.api.tasks.compile.JavaCompile.performCompilation(JavaCompile.java:198)
        at org.gradle.api.tasks.compile.JavaCompile.compile(JavaCompile.java:183)
        at org.gradle.api.tasks.compile.JavaCompile.compile(JavaCompile.java:120)
        at jdk.internal.reflect.GeneratedMethodAccessor464.invoke(Unknown Source)
        at java.base/jdk.internal.reflect.DelegatingMethodAccessorImpl.invoke(DelegatingMethodAccessorImpl.java:43)
        at org.gradle.internal.reflect.JavaMethod.invoke(JavaMethod.java:73)
        at org.gradle.api.internal.project.taskfactory.DefaultTaskClassInfoStore$IncrementalTaskAction.doExecute(DefaultTaskClassInfoStore.java:173)
        at org.gradle.api.internal.project.taskfactory.DefaultTaskClassInfoStore$StandardTaskAction.execute(DefaultTaskClassInfoStore.java:134)
        at org.gradle.api.internal.project.taskfactory.DefaultTaskClassInfoStore$StandardTaskAction.execute(DefaultTaskClassInfoStore.java:121)
        at org.gradle.api.internal.tasks.execution.ExecuteActionsTaskExecuter$1.run(ExecuteActionsTaskExecuter.java:122)
        at org.gradle.internal.progress.DefaultBuildOperationExecutor$RunnableBuildOperationWorker.execute(DefaultBuildOperationExecutor.java:336)
        at org.gradle.internal.progress.DefaultBuildOperationExecutor$RunnableBuildOperationWorker.execute(DefaultBuildOperationExecutor.java:328)
        at org.gradle.internal.progress.DefaultBuildOperationExecutor.execute(DefaultBuildOperationExecutor.java:197)
        at org.gradle.internal.progress.DefaultBuildOperationExecutor.run(DefaultBuildOperationExecutor.java:107)
        at org.gradle.api.internal.tasks.execution.ExecuteActionsTaskExecuter.executeAction(ExecuteActionsTaskExecuter.java:111)
        at org.gradle.api.internal.tasks.execution.ExecuteActionsTaskExecuter.executeActions(ExecuteActionsTaskExecuter.java:92)
        ... 27 more
Caused by: java.lang.reflect.UndeclaredThrowableException
        at com.sun.proxy.$Proxy75.handleOption(Unknown Source)
        at jdk.compiler/com.sun.tools.javac.api.ClientCodeWrapper$WrappedJavaFileManager.handleOption(ClientCodeWrapper.java:265)
        at jdk.compiler/com.sun.tools.javac.main.Arguments.doProcessArgs(Arguments.java:410)
        at jdk.compiler/com.sun.tools.javac.main.Arguments.processArgs(Arguments.java:367)
        at jdk.compiler/com.sun.tools.javac.main.Arguments.init(Arguments.java:246)
        at jdk.compiler/com.sun.tools.javac.api.JavacTool.getTask(JavacTool.java:185)
        ... 53 more
Caused by: java.lang.reflect.InvocationTargetException
        at jdk.internal.reflect.GeneratedMethodAccessor244.invoke(Unknown Source)
        at java.base/jdk.internal.reflect.DelegatingMethodAccessorImpl.invoke(DelegatingMethodAccessorImpl.java:43)
        at org.gradle.api.internal.tasks.compile.reflect.SourcepathIgnoringInvocationHandler.invoke(SourcepathIgnoringInvocationHandler.java:65)
        ... 59 more
Caused by: java.nio.file.InvalidPathException: Illegal char <:> at index 4: file:/D:/3.6/ice/java/lib/ice-3.6.4.jar
        at jdk.compiler/com.sun.tools.javac.file.FSInfo.getJarClassPath(FSInfo.java:112)
        at jdk.compiler/com.sun.tools.javac.file.CacheFSInfo.getJarClassPath(CacheFSInfo.java:93)
        at jdk.compiler/com.sun.tools.javac.file.Locations$SearchPath.addJarClassPath(Locations.java:421)
        at jdk.compiler/com.sun.tools.javac.file.Locations$SearchPath.addFile(Locations.java:411)
        at jdk.compiler/com.sun.tools.javac.file.Locations$SearchPath.addFiles(Locations.java:343)
        at jdk.compiler/com.sun.tools.javac.file.Locations$SearchPath.addFiles(Locations.java:331)
        at jdk.compiler/com.sun.tools.javac.file.Locations$SearchPath.addFiles(Locations.java:337)
        at jdk.compiler/com.sun.tools.javac.file.Locations$SimpleLocationHandler.handleOption(Locations.java:689)
        at jdk.compiler/com.sun.tools.javac.file.Locations.handleOption(Locations.java:2002)
        at jdk.compiler/com.sun.tools.javac.file.BaseFileManager.handleOption(BaseFileManager.java:269)
        at jdk.compiler/com.sun.tools.javac.file.BaseFileManager$2.handleFileManagerOption(BaseFileManager.java:222)
        at jdk.compiler/com.sun.tools.javac.main.Option.process(Option.java:1148)
        at jdk.compiler/com.sun.tools.javac.main.Option.handleOption(Option.java:1096)
        at jdk.compiler/com.sun.tools.javac.file.BaseFileManager.handleOption(BaseFileManager.java:232)
        ... 62 more

Any ideas, it seems related to the local dependency path D:/3.6/ice/java/lib/ice-3.6.4.jar but so fart this works fine with other JDKs

The dependecy is to a local project in the same build declared as

dependencies {
    compile project(":ice")
}