Gradle test mergeAndroidReports fails with internal error


(Christopher Nelson) #1

:mergeAndroidReports

FAILURE: Build aborted because of an internal error.

  • What went wrong: Build aborted because of an unexpected internal error. Please file an issue at: http://forums.gradle.org.

  • Try: Run with --debug option to get additional debug info.

  • Exception is: groovy.lang.MissingPropertyException: No such property: REPORTS for class: com.android.build.gradle.ReportingPlugin

at org.codehaus.groovy.runtime.ScriptBytecodeAdapter.unwrap(ScriptBytecodeAdapter.java:50)

at org.codehaus.groovy.runtime.callsite.PogoGetPropertySite.getProperty(PogoGetPropertySite.java:49)

at org.codehaus.groovy.runtime.callsite.AbstractCallSite.callGroovyObjectGetProperty(AbstractCallSite.java:231)

at com.android.build.gradle.ReportingPlugin$_apply_closure2.doCall(ReportingPlugin.groovy:60)

at sun.reflect.NativeMethodAccessorImpl.invoke0(Native Method)

at sun.reflect.NativeMethodAccessorImpl.invoke(NativeMethodAccessorImpl.java:57)

at sun.reflect.DelegatingMethodAccessorImpl.invoke(DelegatingMethodAccessorImpl.java:43)

at java.lang.reflect.Method.invoke(Method.java:601)

at org.codehaus.groovy.reflection.CachedMethod.invoke(CachedMethod.java:90)

at groovy.lang.MetaMethod.doMethodInvoke(MetaMethod.java:233)

at org.codehaus.groovy.runtime.metaclass.ClosureMetaClass.invokeMethod(ClosureMetaClass.java:272)

at groovy.lang.MetaClassImpl.invokeMethod(MetaClassImpl.java:877)

at groovy.lang.Closure.call(Closure.java:412)

at groovy.lang.Closure.call(Closure.java:425)

at org.gradle.api.internal.ConventionAwareHelper$1.getValue(ConventionAwareHelper.java:75)

at org.gradle.api.internal.ConventionAwareHelper$MappedPropertyImpl.getValue(ConventionAwareHelper.java:139)

at org.gradle.api.internal.ConventionAwareHelper.getConventionValue(ConventionAwareHelper.java:117)

at com.android.build.gradle.internal.tasks.AndroidReportTask_Decorated.getReportsDir(Unknown Source)

at sun.reflect.NativeMethodAccessorImpl.invoke0(Native Method)

at sun.reflect.NativeMethodAccessorImpl.invoke(NativeMethodAccessorImpl.java:57)

at sun.reflect.DelegatingMethodAccessorImpl.invoke(DelegatingMethodAccessorImpl.java:43)

at java.lang.reflect.Method.invoke(Method.java:601)

at org.codehaus.groovy.reflection.CachedMethod.invoke(CachedMethod.java:90)

at groovy.lang.MetaMethod.doMethodInvoke(MetaMethod.java:233)

at groovy.lang.MetaClassImpl.invokeMethod(MetaClassImpl.java:1047)

at groovy.lang.MetaClassImpl.invokeMethod(MetaClassImpl.java:877)

at org.gradle.api.internal.BeanDynamicObject$MetaClassAdapter.invokeMethod(BeanDynamicObject.java:216)

at org.gradle.api.internal.BeanDynamicObject.invokeMethod(BeanDynamicObject.java:122)

at org.gradle.api.internal.CompositeDynamicObject.invokeMethod(CompositeDynamicObject.java:147)

at com.android.build.gradle.internal.tasks.AndroidReportTask_Decorated.invokeMethod(Unknown Source)

at groovy.lang.GroovyObject$invokeMethod.call(Unknown Source)

at org.gradle.util.ReflectionUtil.invoke(ReflectionUtil.groovy:23)

at org.gradle.api.internal.project.taskfactory.AnnotationProcessingTaskFactory$PropertyInfo.getValue(AnnotationProcessingTaskFactory.java:440)

at org.gradle.api.internal.project.taskfactory.AnnotationProcessingTaskFactory$Validator.validate(AnnotationProcessingTaskFactory.java:267)

at org.gradle.api.internal.tasks.execution.ValidatingTaskExecuter.execute(ValidatingTaskExecuter.java:40)

at org.gradle.api.internal.tasks.execution.SkipEmptySourceFilesTaskExecuter.execute(SkipEmptySourceFilesTaskExecuter.java:41)

at org.gradle.api.internal.tasks.execution.SkipTaskWithNoActionsExecuter.execute(SkipTaskWithNoActionsExecuter.java:51)

at org.gradle.api.internal.tasks.execution.SkipOnlyIfTaskExecuter.execute(SkipOnlyIfTaskExecuter.java:52)

at org.gradle.api.internal.tasks.execution.ExecuteAtMostOnceTaskExecuter.execute(ExecuteAtMostOnceTaskExecuter.java:42)

at org.gradle.api.internal.AbstractTask.executeWithoutThrowingTaskFailure(AbstractTask.java:282)

at org.gradle.execution.taskgraph.DefaultTaskPlanExecutor.executeTask(DefaultTaskPlanExecutor.java:48)

at org.gradle.execution.taskgraph.DefaultTaskPlanExecutor.processTask(DefaultTaskPlanExecutor.java:34)

at org.gradle.execution.taskgraph.DefaultTaskPlanExecutor.process(DefaultTaskPlanExecutor.java:27)

at org.gradle.execution.taskgraph.DefaultTaskGraphExecuter.execute(DefaultTaskGraphExecuter.java:89)

at org.gradle.execution.SelectedTaskExecutionAction.execute(SelectedTaskExecutionAction.java:29)

at org.gradle.execution.DefaultBuildExecuter.execute(DefaultBuildExecuter.java:61)

at org.gradle.execution.DefaultBuildExecuter.access$200(DefaultBuildExecuter.java:23)

at org.gradle.execution.DefaultBuildExecuter$2.proceed(DefaultBuildExecuter.java:67)

at org.gradle.api.internal.changedetection.state.TaskCacheLockHandlingBuildExecuter$1.run(TaskCacheLockHandlingBuildExecuter.java:31)

at org.gradle.internal.Factories$1.create(Factories.java:22)

at org.gradle.cache.internal.DefaultCacheAccess.useCache(DefaultCacheAccess.java:124)

at org.gradle.cache.internal.DefaultCacheAccess.useCache(DefaultCacheAccess.java:112)

at org.gradle.cache.internal.DefaultPersistentDirectoryStore.useCache(DefaultPersistentDirectoryStore.java:134)

at org.gradle.api.internal.changedetection.state.DefaultTaskArtifactStateCacheAccess.useCache(DefaultTaskArtifactStateCacheAccess.java:79)

at org.gradle.api.internal.changedetection.state.TaskCacheLockHandlingBuildExecuter.execute(TaskCacheLockHandlingBuildExecuter.java:29)

at org.gradle.execution.DefaultBuildExecuter.execute(DefaultBuildExecuter.java:61)

at org.gradle.execution.DefaultBuildExecuter.access$200(DefaultBuildExecuter.java:23)

at org.gradle.execution.DefaultBuildExecuter$2.proceed(DefaultBuildExecuter.java:67)

at org.gradle.execution.DryRunBuildExecutionAction.execute(DryRunBuildExecutionAction.java:32)

at org.gradle.execution.DefaultBuildExecuter.execute(DefaultBuildExecuter.java:61)

at org.gradle.execution.DefaultBuildExecuter.execute(DefaultBuildExecuter.java:54)

at org.gradle.initialization.DefaultGradleLauncher.doBuildStages(DefaultGradleLauncher.java:166)

at org.gradle.initialization.DefaultGradleLauncher.doBuild(DefaultGradleLauncher.java:113)

at org.gradle.initialization.DefaultGradleLauncher.run(DefaultGradleLauncher.java:81)

at org.gradle.launcher.exec.InProcessBuildActionExecuter$DefaultBuildController.run(InProcessBuildActionExecuter.java:64)

at org.gradle.launcher.cli.ExecuteBuildAction.run(ExecuteBuildAction.java:33)

at org.gradle.launcher.cli.ExecuteBuildAction.run(ExecuteBuildAction.java:24)

at org.gradle.launcher.exec.InProcessBuildActionExecuter.execute(InProcessBuildActionExecuter.java:35)

at org.gradle.launcher.exec.InProcessBuildActionExecuter.execute(InProcessBuildActionExecuter.java:26)

at org.gradle.launcher.cli.RunBuildAction.run(RunBuildAction.java:50)

at org.gradle.api.internal.Actions$RunnableActionAdapter.execute(Actions.java:171)

at org.gradle.launcher.cli.CommandLineActionFactory$ParseAndBuildAction.execute(CommandLineActionFactory.java:201)

at org.gradle.launcher.cli.CommandLineActionFactory$ParseAndBuildAction.execute(CommandLineActionFactory.java:174)

at org.gradle.launcher.cli.CommandLineActionFactory$WithLogging.execute(CommandLineActionFactory.java:170)

at org.gradle.launcher.cli.CommandLineActionFactory$WithLogging.execute(CommandLineActionFactory.java:139)

at org.gradle.launcher.cli.ExceptionReportingAction.execute(ExceptionReportingAction.java:33)

at org.gradle.launcher.cli.ExceptionReportingAction.execute(ExceptionReportingAction.java:22)

at org.gradle.launcher.Main.doAction(Main.java:48)

at org.gradle.launcher.bootstrap.EntryPoint.run(EntryPoint.java:45)

at org.gradle.launcher.Main.main(Main.java:39)

at sun.reflect.NativeMethodAccessorImpl.invoke0(Native Method)

at sun.reflect.NativeMethodAccessorImpl.invoke(NativeMethodAccessorImpl.java:57)

at sun.reflect.DelegatingMethodAccessorImpl.invoke(DelegatingMethodAccessorImpl.java:43)

at java.lang.reflect.Method.invoke(Method.java:601)

at org.gradle.launcher.bootstrap.ProcessBootstrap.runNoExit(ProcessBootstrap.java:50)

at org.gradle.launcher.bootstrap.ProcessBootstrap.run(ProcessBootstrap.java:32)

at org.gradle.launcher.GradleMain.main(GradleMain.java:26)

BUILD FAILED


(Luke Daley) #2

Hi, this is a configuration problem with the Android plugin.

You can find out about how to get in touch with those guys @ http://tools.android.com/feedback


(Christopher Nelson) #3

Filed as https://code.google.com/p/android/issues/detail?id=56235&thanks=56235&ts=1370377617