Gradle 2.14-rc-5: eclipseProject throws NPE for existing .project file with linked resources


(ohorn) #1

Gradle Version: 2.14-rc-5
Operating System: Windows, Linux
Is this a regression? Yes, 2.13 worked.

Executing the eclipseProject task fails if the .project file already exists and the file contains one or more linkedResources entries.

The following simplified build script reproduces the error:

plugins {
    id 'eclipse'
}
eclipse {
    project {
        linkedResource name: 'README.md', type: '1', locationUri: 'PARENT-1-PROJECT_LOC/README.md'
    }
}

Running gradle eclipseProject two times in a row fails with the following exception:

FAILURE: Build failed with an exception.

* What went wrong:
Execution failed for task ':eclipseProject'.
> Cannot parse file '/tmp/gradle214-bug/.project'.
         Perhaps this file was tinkered with? In that case try delete this file and then retry.

* Try:
Run with --info or --debug option to get more log output.

* Exception is:
org.gradle.api.tasks.TaskExecutionException: Execution failed for task ':eclipseProject'.
    at org.gradle.api.internal.tasks.execution.ExecuteActionsTaskExecuter.executeActions(ExecuteActionsTaskExecuter.java:69)
    at org.gradle.api.internal.tasks.execution.ExecuteActionsTaskExecuter.execute(ExecuteActionsTaskExecuter.java:46)
    at org.gradle.api.internal.tasks.execution.PostExecutionAnalysisTaskExecuter.execute(PostExecutionAnalysisTaskExecuter.java:35)
    at org.gradle.api.internal.tasks.execution.SkipUpToDateTaskExecuter.execute(SkipUpToDateTaskExecuter.java:66)
    at org.gradle.api.internal.tasks.execution.ValidatingTaskExecuter.execute(ValidatingTaskExecuter.java:58)
    at org.gradle.api.internal.tasks.execution.SkipEmptySourceFilesTaskExecuter.execute(SkipEmptySourceFilesTaskExecuter.java:52)
    at org.gradle.api.internal.tasks.execution.SkipTaskWithNoActionsExecuter.execute(SkipTaskWithNoActionsExecuter.java:52)
    at org.gradle.api.internal.tasks.execution.SkipOnlyIfTaskExecuter.execute(SkipOnlyIfTaskExecuter.java:53)
    at org.gradle.api.internal.tasks.execution.ExecuteAtMostOnceTaskExecuter.execute(ExecuteAtMostOnceTaskExecuter.java:43)
    at org.gradle.execution.taskgraph.DefaultTaskGraphExecuter$EventFiringTaskWorker.execute(DefaultTaskGraphExecuter.java:203)
    at org.gradle.execution.taskgraph.DefaultTaskGraphExecuter$EventFiringTaskWorker.execute(DefaultTaskGraphExecuter.java:185)
    at org.gradle.execution.taskgraph.AbstractTaskPlanExecutor$TaskExecutorWorker.processTask(AbstractTaskPlanExecutor.java:66)
    at org.gradle.execution.taskgraph.AbstractTaskPlanExecutor$TaskExecutorWorker.run(AbstractTaskPlanExecutor.java:50)
    at org.gradle.execution.taskgraph.DefaultTaskPlanExecutor.process(DefaultTaskPlanExecutor.java:25)
    at org.gradle.execution.taskgraph.DefaultTaskGraphExecuter.execute(DefaultTaskGraphExecuter.java:110)
    at org.gradle.execution.SelectedTaskExecutionAction.execute(SelectedTaskExecutionAction.java:37)
    at org.gradle.execution.DefaultBuildExecuter.execute(DefaultBuildExecuter.java:37)
    at org.gradle.execution.DefaultBuildExecuter.access$000(DefaultBuildExecuter.java:23)
    at org.gradle.execution.DefaultBuildExecuter$1.proceed(DefaultBuildExecuter.java:43)
    at org.gradle.execution.DryRunBuildExecutionAction.execute(DryRunBuildExecutionAction.java:32)
    at org.gradle.execution.DefaultBuildExecuter.execute(DefaultBuildExecuter.java:37)
    at org.gradle.execution.DefaultBuildExecuter.execute(DefaultBuildExecuter.java:30)
    at org.gradle.initialization.DefaultGradleLauncher$4.run(DefaultGradleLauncher.java:153)
    at org.gradle.internal.Factories$1.create(Factories.java:22)
    at org.gradle.internal.progress.DefaultBuildOperationExecutor.run(DefaultBuildOperationExecutor.java:91)
    at org.gradle.internal.progress.DefaultBuildOperationExecutor.run(DefaultBuildOperationExecutor.java:53)
    at org.gradle.initialization.DefaultGradleLauncher.doBuildStages(DefaultGradleLauncher.java:150)
    at org.gradle.initialization.DefaultGradleLauncher.access$200(DefaultGradleLauncher.java:32)
    at org.gradle.initialization.DefaultGradleLauncher$1.create(DefaultGradleLauncher.java:98)
    at org.gradle.initialization.DefaultGradleLauncher$1.create(DefaultGradleLauncher.java:92)
    at org.gradle.internal.progress.DefaultBuildOperationExecutor.run(DefaultBuildOperationExecutor.java:91)
    at org.gradle.internal.progress.DefaultBuildOperationExecutor.run(DefaultBuildOperationExecutor.java:63)
    at org.gradle.initialization.DefaultGradleLauncher.doBuild(DefaultGradleLauncher.java:92)
    at org.gradle.initialization.DefaultGradleLauncher.run(DefaultGradleLauncher.java:83)
    at org.gradle.launcher.exec.InProcessBuildActionExecuter$DefaultBuildController.run(InProcessBuildActionExecuter.java:99)
    at org.gradle.tooling.internal.provider.ExecuteBuildActionRunner.run(ExecuteBuildActionRunner.java:28)
    at org.gradle.launcher.exec.ChainingBuildActionRunner.run(ChainingBuildActionRunner.java:35)
    at org.gradle.launcher.exec.InProcessBuildActionExecuter.execute(InProcessBuildActionExecuter.java:48)
    at org.gradle.launcher.exec.InProcessBuildActionExecuter.execute(InProcessBuildActionExecuter.java:30)
    at org.gradle.launcher.exec.ContinuousBuildActionExecuter.execute(ContinuousBuildActionExecuter.java:81)
    at org.gradle.launcher.exec.ContinuousBuildActionExecuter.execute(ContinuousBuildActionExecuter.java:46)
    at org.gradle.launcher.exec.DaemonUsageSuggestingBuildActionExecuter.execute(DaemonUsageSuggestingBuildActionExecuter.java:51)
    at org.gradle.launcher.exec.DaemonUsageSuggestingBuildActionExecuter.execute(DaemonUsageSuggestingBuildActionExecuter.java:28)
    at org.gradle.launcher.cli.RunBuildAction.run(RunBuildAction.java:43)
    at org.gradle.internal.Actions$RunnableActionAdapter.execute(Actions.java:173)
    at org.gradle.launcher.cli.CommandLineActionFactory$ParseAndBuildAction.execute(CommandLineActionFactory.java:239)
    at org.gradle.launcher.cli.CommandLineActionFactory$ParseAndBuildAction.execute(CommandLineActionFactory.java:212)
    at org.gradle.launcher.cli.JavaRuntimeValidationAction.execute(JavaRuntimeValidationAction.java:35)
    at org.gradle.launcher.cli.JavaRuntimeValidationAction.execute(JavaRuntimeValidationAction.java:24)
    at org.gradle.launcher.cli.ExceptionReportingAction.execute(ExceptionReportingAction.java:33)
    at org.gradle.launcher.cli.ExceptionReportingAction.execute(ExceptionReportingAction.java:22)
    at org.gradle.launcher.cli.CommandLineActionFactory$WithLogging.execute(CommandLineActionFactory.java:205)
    at org.gradle.launcher.cli.CommandLineActionFactory$WithLogging.execute(CommandLineActionFactory.java:169)
    at org.gradle.launcher.Main.doAction(Main.java:33)
    at org.gradle.launcher.bootstrap.EntryPoint.run(EntryPoint.java:45)
    at org.gradle.launcher.bootstrap.ProcessBootstrap.runNoExit(ProcessBootstrap.java:55)
    at org.gradle.launcher.bootstrap.ProcessBootstrap.run(ProcessBootstrap.java:36)
    at org.gradle.launcher.GradleMain.main(GradleMain.java:23)
    at org.gradle.wrapper.BootstrapMainStarter.start(BootstrapMainStarter.java:30)
    at org.gradle.wrapper.WrapperExecutor.execute(WrapperExecutor.java:129)
    at org.gradle.wrapper.GradleWrapperMain.main(GradleWrapperMain.java:61)
Caused by: org.gradle.api.GradleException: Cannot parse file '/tmp/gradle214-bug/.project'.
       Perhaps this file was tinkered with? In that case try delete this file and then retry.
    at org.gradle.plugins.ide.api.GeneratorTask.generate(GeneratorTask.java:70)
    at org.gradle.internal.reflect.JavaMethod.invoke(JavaMethod.java:75)
    at org.gradle.api.internal.project.taskfactory.AnnotationProcessingTaskFactory$StandardTaskAction.doExecute(AnnotationProcessingTaskFactory.java:228)
    at org.gradle.api.internal.project.taskfactory.AnnotationProcessingTaskFactory$StandardTaskAction.execute(AnnotationProcessingTaskFactory.java:221)
    at org.gradle.api.internal.project.taskfactory.AnnotationProcessingTaskFactory$StandardTaskAction.execute(AnnotationProcessingTaskFactory.java:210)
    at org.gradle.api.internal.AbstractTask$TaskActionWrapper.execute(AbstractTask.java:621)
    at org.gradle.api.internal.AbstractTask$TaskActionWrapper.execute(AbstractTask.java:604)
    at org.gradle.api.internal.tasks.execution.ExecuteActionsTaskExecuter.executeAction(ExecuteActionsTaskExecuter.java:80)
    at org.gradle.api.internal.tasks.execution.ExecuteActionsTaskExecuter.executeActions(ExecuteActionsTaskExecuter.java:61)
    ... 60 more
Caused by: java.lang.NullPointerException
    at org.gradle.plugins.ide.eclipse.model.Project.readLinkedResources(Project.java:177)
    at org.gradle.plugins.ide.eclipse.model.Project.load(Project.java:143)
    at org.gradle.plugins.ide.internal.generator.XmlPersistableConfigurationObject.load(XmlPersistableConfigurationObject.java:50)
    at org.gradle.plugins.ide.internal.generator.AbstractPersistableConfigurationObject.load(AbstractPersistableConfigurationObject.java:36)
    at org.gradle.plugins.ide.internal.generator.generator.PersistableConfigurationObjectGenerator.read(PersistableConfigurationObjectGenerator.java:32)
    at org.gradle.plugins.ide.internal.generator.generator.PersistableConfigurationObjectGenerator.read(PersistableConfigurationObjectGenerator.java:28)
    at org.gradle.plugins.ide.api.GeneratorTask.generate(GeneratorTask.java:68)
    ... 68 more

(Paul Merlin) #2

Thanks for the report!
See https://issues.gradle.org/browse/GRADLE-3480


(Sterling Greene) #3

Could you give RC6 a try? It contains a fix for your problem.

./gradlew wrapper --gradle-version=2.14-rc-6


(ohorn) #4

RC-6 works fine. Thanks a lot!