Build aborted because of an internal error


(Tom Eugelink) #1

I’m trying to release JFXtras to Sonatype. I followed the generic instructions (https://docs.sonatype.org/display/Repository/Sonatype+OSS+Maven+Repository+Usage+Guide#SonatypeOSSMavenRepositoryUsageGuide-7d.StageReleaseswithGradle) and the gradle instructions (http://jedicoder.blogspot.nl/2011/11/automated-gradle-project-deployment-to.html). I should be set up, but I end up with the question to post a problem report on this forum.

C:\Documents and Settings\User\My Documents\jfxtras-labs>gradlew uploadArchives … … … :compileJava UP-TO-DATE :processResources UP-TO-DATE :classes UP-TO-DATE :javadoc UP-TO-DATE :docJar UP-TO-DATE :jar UP-TO-DATE :sourcesJar UP-TO-DATE :signArchives

FAILURE: Build aborted because of an internal error.

  • What went wrong: Build aborted because of an unexpected internal error. Please file an issue at: http://forums.gradle.org.

  • Try: Run with --debug option to get additional debug info.

  • Exception is: org.codehaus.groovy.runtime.InvokerInvocationException: org.bouncycastle.openpgp .PGPException: checksum mismatch at 0 of 20

at org.codehaus.groovy.reflection.CachedMethod.invoke(CachedMethod.java: 97)

at groovy.lang.MetaMethod.doMethodInvoke(MetaMethod.java:233)

at org.codehaus.groovy.runtime.metaclass.ClosureMetaClass.invokeMethod(C losureMetaClass.java:272)

at groovy.lang.MetaClassImpl.invokeMethod(MetaClassImpl.java:877)

at groovy.lang.Closure.call(Closure.java:412)

at groovy.lang.Closure.call(Closure.java:406)

at org.gradle.api.internal.tasks.DefaultTaskInputs.unwrap(DefaultTaskInp uts.java:103)

at org.gradle.api.internal.tasks.DefaultTaskInputs.getProperties(Default TaskInputs.java:92)

at org.gradle.api.internal.changedetection.InputPropertiesChangedUpToDat eRule.create(InputPropertiesChangedUpToDateRule.java:31)

at org.gradle.api.internal.changedetection.CompositeUpToDateRule.create( CompositeUpToDateRule.java:35)

at org.gradle.api.internal.changedetection.DefaultTaskArtifactStateRepos itory$HistoricExecution.calcCurrentState(DefaultTaskArtifactStateRepository.java :80)

at org.gradle.api.internal.changedetection.DefaultTaskArtifactStateRepos itory$HistoricExecution.isUpToDate(DefaultTaskArtifactStateRepository.java:88)

at org.gradle.api.internal.changedetection.DefaultTaskArtifactStateRepos itory$TaskArtifactStateImpl.isUpToDate(DefaultTaskArtifactStateRepository.java:1 28)

at org.gradle.api.internal.changedetection.ShortCircuitTaskArtifactState Repository$ShortCircuitArtifactState.isUpToDate(ShortCircuitTaskArtifactStateRep ository.java:77)

at org.gradle.api.internal.changedetection.FileCacheBroadcastTaskArtifac tStateRepository$1.isUpToDate(FileCacheBroadcastTaskArtifactStateRepository.java :37)

at org.gradle.api.internal.tasks.execution.SkipUpToDateTaskExecuter.exec ute(SkipUpToDateTaskExecuter.java:44)

at org.gradle.api.internal.tasks.execution.ValidatingTaskExecuter.execut e(ValidatingTaskExecuter.java:57)

at org.gradle.api.internal.tasks.execution.SkipEmptySourceFilesTaskExecu ter.execute(SkipEmptySourceFilesTaskExecuter.java:41)

at org.gradle.api.internal.tasks.execution.SkipTaskWithNoActionsExecuter .execute(SkipTaskWithNoActionsExecuter.java:51)

at org.gradle.api.internal.tasks.execution.SkipOnlyIfTaskExecuter.execut e(SkipOnlyIfTaskExecuter.java:52)

at org.gradle.api.internal.tasks.execution.ExecuteAtMostOnceTaskExecuter .execute(ExecuteAtMostOnceTaskExecuter.java:42)

at org.gradle.api.internal.AbstractTask.executeWithoutThrowingTaskFailur e(AbstractTask.java:247)

at org.gradle.execution.DefaultTaskGraphExecuter.executeTask(DefaultTask GraphExecuter.java:192)

at org.gradle.execution.DefaultTaskGraphExecuter.doExecute(DefaultTaskGr aphExecuter.java:177)

at org.gradle.execution.DefaultTaskGraphExecuter.execute(DefaultTaskGrap hExecuter.java:83)

at org.gradle.execution.SelectedTaskExecutionAction.execute(SelectedTask ExecutionAction.java:36)

at org.gradle.execution.DefaultBuildExecuter.execute(DefaultBuildExecute r.java:61)

at org.gradle.execution.DefaultBuildExecuter.access$200(DefaultBuildExec uter.java:23)

at org.gradle.execution.DefaultBuildExecuter$2.proceed(DefaultBuildExecu ter.java:67)

at org.gradle.api.internal.changedetection.TaskCacheLockHandlingBuildExe cuter$1.run(TaskCacheLockHandlingBuildExecuter.java:31)

at org.gradle.cache.internal.DefaultCacheAccess$1.create(DefaultCacheAcc ess.java:111)

at org.gradle.cache.internal.DefaultCacheAccess.useCache(DefaultCacheAcc ess.java:126)

at org.gradle.cache.internal.DefaultCacheAccess.useCache(DefaultCacheAcc ess.java:109)

at org.gradle.cache.internal.DefaultPersistentDirectoryStore.useCache(De faultPersistentDirectoryStore.java:103)

at org.gradle.api.internal.changedetection.DefaultTaskArtifactStateCache Access.useCache(DefaultTaskArtifactStateCacheAccess.java:79)

at org.gradle.api.internal.changedetection.TaskCacheLockHandlingBuildExe cuter.execute(TaskCacheLockHandlingBuildExecuter.java:29)

at org.gradle.execution.DefaultBuildExecuter.execute(DefaultBuildExecute r.java:61)

at org.gradle.execution.DefaultBuildExecuter.access$200(DefaultBuildExec uter.java:23)

at org.gradle.execution.DefaultBuildExecuter$2.proceed(DefaultBuildExecu ter.java:67)

at org.gradle.execution.DryRunBuildExecutionAction.execute(DryRunBuildEx ecutionAction.java:32)

at org.gradle.execution.DefaultBuildExecuter.execute(DefaultBuildExecute r.java:61)

at org.gradle.execution.DefaultBuildExecuter.execute(DefaultBuildExecute r.java:54)

at org.gradle.initialization.DefaultGradleLauncher.doBuildStages(Default GradleLauncher.java:155)

at org.gradle.initialization.DefaultGradleLauncher.doBuild(DefaultGradle Launcher.java:110)

at org.gradle.initialization.DefaultGradleLauncher.run(DefaultGradleLaun cher.java:78)

at org.gradle.launcher.cli.RunBuildAction.execute(RunBuildAction.java:42 )

at org.gradle.launcher.cli.RunBuildAction.execute(RunBuildAction.java:28 )

at org.gradle.launcher.cli.CommandLineActionFactory$ParseAndBuildAction. execute(CommandLineActionFactory.java:201)

at org.gradle.launcher.cli.CommandLineActionFactory$ParseAndBuildAction. execute(CommandLineActionFactory.java:174)

at org.gradle.launcher.cli.CommandLineActionFactory$WithLogging.execute( CommandLineActionFactory.java:170)

at org.gradle.launcher.cli.CommandLineActionFactory$WithLogging.execute( CommandLineActionFactory.java:139)

at org.gradle.launcher.exec.ExceptionReportingAction.execute(ExceptionRe portingAction.java:31)

at org.gradle.launcher.exec.ExceptionReportingAction.execute(ExceptionRe portingAction.java:20)

at org.gradle.launcher.Main.doAction(Main.java:48)

at org.gradle.launcher.exec.EntryPoint.run(EntryPoint.java:45)

at org.gradle.launcher.Main.main(Main.java:39)

at sun.reflect.NativeMethodAccessorImpl.invoke0(Native Method)

at sun.reflect.NativeMethodAccessorImpl.invoke(NativeMethodAccessorImpl. java:57)

at sun.reflect.DelegatingMethodAccessorImpl.invoke(DelegatingMethodAcces sorImpl.java:43)

at java.lang.reflect.Method.invoke(Method.java:601)

at org.gradle.launcher.ProcessBootstrap.runNoExit(ProcessBootstrap.java: 50)

at org.gradle.launcher.ProcessBootstrap.run(ProcessBootstrap.java:32)

at org.gradle.launcher.GradleMain.main(GradleMain.java:24)

at sun.reflect.NativeMethodAccessorImpl.invoke0(Native Method)

at sun.reflect.NativeMethodAccessorImpl.invoke(NativeMethodAccessorImpl. java:57)

at sun.reflect.DelegatingMethodAccessorImpl.invoke(DelegatingMethodAcces sorImpl.java:43)

at java.lang.reflect.Method.invoke(Method.java:601)

at org.gradle.wrapper.BootstrapMainStarter.start(BootstrapMainStarter.ja va:33)

at org.gradle.wrapper.WrapperExecutor.execute(WrapperExecutor.java:130)

at org.gradle.wrapper.GradleWrapperMain.main(GradleWrapperMain.java:47) Caused by: org.bouncycastle.openpgp.PGPException: checksum mismatch at 0 of 20

at org.bouncycastle.openpgp.PGPSecretKey.extractKeyData(Unknown Source)

at org.bouncycastle.openpgp.PGPSecretKey.extractPrivateKey(Unknown Sourc e)

at org.bouncycastle.openpgp.PGPSecretKey.extractPrivateKey(Unknown Sourc e)

at org.bouncycastle.openpgp.PGPSecretKey$extractPrivateKey.call(Unknown Source)

at org.codehaus.groovy.runtime.callsite.CallSiteArray.defaultCall(CallSi teArray.java:42)

at org.codehaus.groovy.runtime.callsite.AbstractCallSite.call(AbstractCa llSite.java:108)

at org.codehaus.groovy.runtime.callsite.AbstractCallSite.call(AbstractCa llSite.java:120)

at org.gradle.plugins.signing.signatory.pgp.PgpSignatory.(PgpSigna tory.groovy:45)

at sun.reflect.NativeConstructorAccessorImpl.newInstance0(Native Method)

at sun.reflect.NativeConstructorAccessorImpl.newInstance(NativeConstruct orAccessorImpl.java:57)

at sun.reflect.DelegatingConstructorAccessorImpl.newInstance(DelegatingC onstructorAccessorImpl.java:45)

at java.lang.reflect.Constructor.newInstance(Constructor.java:525)

at org.codehaus.groovy.reflection.CachedConstructor.invoke(CachedConstru ctor.java:77)

at org.codehaus.groovy.runtime.callsite.ConstructorSite$ConstructorSiteN oUnwrapNoCoerce.callConstructor(ConstructorSite.java:102)

at org.codehaus.groovy.runtime.callsite.CallSiteArray.defaultCallConstru ctor(CallSiteArray.java:54)

at org.codehaus.groovy.runtime.callsite.AbstractCallSite.callConstructor (AbstractCallSite.java:182)

at org.codehaus.groovy.runtime.callsite.AbstractCallSite.callConstructor (AbstractCallSite.java:198)

at org.gradle.plugins.signing.signatory.pgp.PgpSignatoryFactory.createSi gnatory(PgpSignatoryFactory.groovy:71)

at org.gradle.plugins.signing.signatory.pgp.PgpSignatoryFactory$createSi gnatory$1.callCurrent(Unknown Source)

at org.codehaus.groovy.runtime.callsite.CallSiteArray.defaultCallCurrent (CallSiteArray.java:46)

at org.codehaus.groovy.runtime.callsite.AbstractCallSite.callCurrent(Abs tractCallSite.java:133)

at org.codehaus.groovy.runtime.callsite.AbstractCallSite.callCurrent(Abs tractCallSite.java:149)

at org.gradle.plugins.signing.signatory.pgp.PgpSignatoryFactory.createSi gnatory(PgpSignatoryFactory.groovy:67)

at org.gradle.plugins.signing.signatory.pgp.PgpSignatoryFactory$createSi gnatory$0.callCurrent(Unknown Source)

at org.codehaus.groovy.runtime.callsite.CallSiteArray.defaultCallCurrent (CallSiteArray.java:46)

at org.codehaus.groovy.runtime.callsite.AbstractCallSite.callCurrent(Abs tractCallSite.java:133)

at org.codehaus.groovy.runtime.callsite.AbstractCallSite.callCurrent(Abs tractCallSite.java:153)

at org.gradle.plugins.signing.signatory.pgp.PgpSignatoryFactory.readProp erties(PgpSignatoryFactory.groovy:59)

at sun.reflect.NativeMethodAccessorImpl.invoke0(Native Method)

at sun.reflect.NativeMethodAccessorImpl.invoke(NativeMethodAccessorImpl. java:57)

at sun.reflect.DelegatingMethodAccessorImpl.invoke(DelegatingMethodAcces sorImpl.java:43)

at java.lang.reflect.Method.invoke(Method.java:601)

at org.codehaus.groovy.runtime.callsite.PogoMetaMethodSite$PogoCachedMet hodSiteNoUnwrapNoCoerce.invoke(PogoMetaMethodSite.java:267)

at org.codehaus.groovy.runtime.callsite.PogoMetaMethodSite.callCurrent(P ogoMetaMethodSite.java:52)

at org.codehaus.groovy.runtime.callsite.CallSiteArray.defaultCallCurrent (CallSiteArray.java:46)

at org.codehaus.groovy.runtime.callsite.AbstractCallSite.callCurrent(Abs tractCallSite.java:133)

at org.codehaus.groovy.runtime.callsite.AbstractCallSite.callCurrent(Abs tractCallSite.java:153)

at org.gradle.plugins.signing.signatory.pgp.PgpSignatoryFactory.createSi gnatory(PgpSignatoryFactory.groovy:29)

at sun.reflect.NativeMethodAccessorImpl.invoke0(Native Method)

at sun.reflect.NativeMethodAccessorImpl.invoke(NativeMethodAccessorImpl. java:57)

at sun.reflect.DelegatingMethodAccessorImpl.invoke(DelegatingMethodAcces sorImpl.java:43)

at java.lang.reflect.Method.invoke(Method.java:601)

at org.codehaus.groovy.runtime.callsite.PogoMetaMethodSite$PogoCachedMet hodSite.invoke(PogoMetaMethodSite.java:226)

at org.codehaus.groovy.runtime.callsite.PogoMetaMethodSite.callCurrent(P ogoMetaMethodSite.java:52)

at org.codehaus.groovy.runtime.callsite.CallSiteArray.defaultCallCurrent (CallSiteArray.java:46)

at org.codehaus.groovy.runtime.callsite.AbstractCallSite.callCurrent(Abs tractCallSite.java:133)

at org.codehaus.groovy.runtime.callsite.AbstractCallSite.callCurrent(Abs tractCallSite.java:145)

at org.gradle.plugins.signing.signatory.pgp.PgpSignatoryFactory.createSi gnatory(PgpSignatoryFactory.groovy)

at org.gradle.plugins.signing.signatory.pgp.PgpSignatoryFactory$createSi gnatory.call(Unknown Source)

at org.codehaus.groovy.runtime.callsite.CallSiteArray.defaultCall(CallSi teArray.java:42)

at org.codehaus.groovy.runtime.callsite.AbstractCallSite.call(AbstractCa llSite.java:108)

at org.codehaus.groovy.runtime.callsite.AbstractCallSite.call(AbstractCa llSite.java:116)

at org.gradle.plugins.signing.signatory.pgp.PgpSignatoryProvider.getDefa ultSignatory(PgpSignatoryProvider.groovy:36)

at org.gradle.plugins.signing.signatory.pgp.PgpSignatoryProvider.getDefa ultSignatory(PgpSignatoryProvider.groovy)

at org.gradle.plugins.signing.signatory.SignatoryProvider$getDefaultSign atory.call(Unknown Source)

at org.codehaus.groovy.runtime.callsite.CallSiteArray.defaultCall(CallSi teArray.java:42)

at org.codehaus.groovy.runtime.callsite.AbstractCallSite.call(AbstractCa llSite.java:108)

at org.codehaus.groovy.runtime.callsite.AbstractCallSite.call(AbstractCa llSite.java:116)

at org.gradle.plugins.signing.SigningExtension.getSignatory(SigningExten sion.groovy:170)

at org.gradle.plugins.signing.SigningExtension_Decorated.getSignatory(Un known Source)

at sun.reflect.NativeMethodAccessorImpl.invoke0(Native Method)

at sun.reflect.NativeMethodAccessorImpl.invoke(NativeMethodAccessorImpl. java:57)

at sun.reflect.DelegatingMethodAccessorImpl.invoke(DelegatingMethodAcces sorImpl.java:43)

at java.lang.reflect.Method.invoke(Method.java:601)

at org.codehaus.groovy.reflection.CachedMethod.invoke(CachedMethod.java: 90)

at groovy.lang.MetaMethod.doMethodInvoke(MetaMethod.java:233)

at org.codehaus.groovy.runtime.metaclass.ClosureMetaClass.invokeMethod(C losureMetaClass.java:361)

at groovy.lang.MetaClassImpl.invokeMethod(MetaClassImpl.java:877)

at org.codehaus.groovy.runtime.callsite.PogoMetaClassSite.callCurrent(Po goMetaClassSite.java:66)

at org.codehaus.groovy.runtime.callsite.CallSiteArray.defaultCallCurrent (CallSiteArray.java:46)

at org.codehaus.groovy.runtime.callsite.AbstractCallSite.callCurrent(Abs tractCallSite.java:133)

at org.codehaus.groovy.runtime.callsite.AbstractCallSite.callCurrent(Abs tractCallSite.java:137)

at org.gradle.plugins.signing.SigningExtension$_addSignatureSpecConventi ons_closure2.doCall(SigningExtension.groovy:198)

at sun.reflect.NativeMethodAccessorImpl.invoke0(Native Method)

at sun.reflect.NativeMethodAccessorImpl.invoke(NativeMethodAccessorImpl. java:57)

at sun.reflect.DelegatingMethodAccessorImpl.invoke(DelegatingMethodAcces sorImpl.java:43)

at java.lang.reflect.Method.invoke(Method.java:601)

at org.codehaus.groovy.reflection.CachedMethod.invoke(CachedMethod.java: 90)

at groovy.lang.MetaMethod.doMethodInvoke(MetaMethod.java:233)

at org.codehaus.groovy.runtime.metaclass.ClosureMetaClass.invokeMethod(C losureMetaClass.java:272)

at groovy.lang.MetaClassImpl.invokeMethod(MetaClassImpl.java:877)

at org.codehaus.groovy.runtime.callsite.PogoMetaClassSite.callCurrent(Po goMetaClassSite.java:66)

at org.codehaus.groovy.runtime.callsite.CallSiteArray.defaultCallCurrent (CallSiteArray.java:46)

at org.codehaus.groovy.runtime.callsite.AbstractCallSite.callCurrent(Abs tractCallSite.java:133)

at org.codehaus.groovy.runtime.callsite.AbstractCallSite.callCurrent(Abs tractCallSite.java:141)

at org.gradle.plugins.signing.SigningExtension$_addSignatureSpecConventi ons_closure2.doCall(SigningExtension.groovy)

at sun.reflect.NativeMethodAccessorImpl.invoke0(Native Method)

at sun.reflect.NativeMethodAccessorImpl.invoke(NativeMethodAccessorImpl. java:57)

at sun.reflect.DelegatingMethodAccessorImpl.invoke(DelegatingMethodAcces sorImpl.java:43)

at java.lang.reflect.Method.invoke(Method.java:601)

at org.codehaus.groovy.reflection.CachedMethod.invoke(CachedMethod.java: 90)

at groovy.lang.MetaMethod.doMethodInvoke(MetaMethod.java:233)

at org.codehaus.groovy.runtime.metaclass.ClosureMetaClass.invokeMethod(C losureMetaClass.java:272)

at groovy.lang.MetaClassImpl.invokeMethod(MetaClassImpl.java:877)

at groovy.lang.Closure.call(Closure.java:412)

at groovy.lang.Closure.call(Closure.java:406)

at org.gradle.api.internal.ConventionAwareHelper$2.getValue(ConventionAw areHelper.java:88)

at org.gradle.api.internal.ConventionAwareHelper$MappedPropertyImpl.getV alue(ConventionAwareHelper.java:148)

at org.gradle.api.internal.ConventionAwareHelper.getConventionValue(Conv entionAwareHelper.java:118)

at org.gradle.plugins.signing.Sign_Decorated.getSignatory(Unknown Source )

at sun.reflect.NativeMethodAccessorImpl.invoke0(Native Method)

at sun.reflect.NativeMethodAccessorImpl.invoke(NativeMethodAccessorImpl. java:57)

at sun.reflect.DelegatingMethodAccessorImpl.invoke(DelegatingMethodAcces sorImpl.java:43)

at java.lang.reflect.Method.invoke(Method.java:601)

at org.codehaus.groovy.reflection.CachedMethod.invoke(CachedMethod.java: 90)

at groovy.lang.MetaMethod.doMethodInvoke(MetaMethod.java:233)

at org.codehaus.groovy.runtime.metaclass.ClosureMetaClass.invokeMethod(C losureMetaClass.java:361)

at groovy.lang.MetaClassImpl.invokeMethod(MetaClassImpl.java:877)

at org.codehaus.groovy.runtime.callsite.PogoMetaClassSite.callCurrent(Po goMetaClassSite.java:66)

at org.codehaus.groovy.runtime.callsite.CallSiteArray.defaultCallCurrent (CallSiteArray.java:46)

at org.codehaus.groovy.runtime.callsite.AbstractCallSite.callCurrent(Abs tractCallSite.java:133)

at org.codehaus.groovy.runtime.callsite.AbstractCallSite.callCurrent(Abs tractCallSite.java:137)

at org.gradle.plugins.signing.Sign$_closure2.doCall(Sign.groovy:69)

at sun.reflect.NativeMethodAccessorImpl.invoke0(Native Method)

at sun.reflect.NativeMethodAccessorImpl.invoke(NativeMethodAccessorImpl. java:57)

at sun.reflect.DelegatingMethodAccessorImpl.invoke(DelegatingMethodAcces sorImpl.java:43)

at java.lang.reflect.Method.invoke(Method.java:601)

at org.codehaus.groovy.reflection.CachedMethod.invoke(CachedMethod.java: 90)

at groovy.lang.MetaMethod.doMethodInvoke(MetaMethod.java:233)

at org.codehaus.groovy.runtime.metaclass.ClosureMetaClass.invokeMethod(C losureMetaClass.java:272)

at groovy.lang.MetaClassImpl.invokeMethod(MetaClassImpl.java:877)

at org.codehaus.groovy.runtime.callsite.PogoMetaClassSite.callCurrent(Po goMetaClassSite.java:66)

at org.codehaus.groovy.runtime.callsite.CallSiteArray.defaultCallCurrent (CallSiteArray.java:46)

at org.codehaus.groovy.runtime.callsite.AbstractCallSite.callCurrent(Abs tractCallSite.java:133)

at org.codehaus.groovy.runtime.callsite.AbstractCallSite.callCurrent(Abs tractCallSite.java:141)

at org.gradle.plugins.signing.Sign$_closure2.doCall(Sign.groovy)

at sun.reflect.NativeMethodAccessorImpl.invoke0(Native Method)

at sun.reflect.NativeMethodAccessorImpl.invoke(NativeMethodAccessorImpl. java:57)

at sun.reflect.DelegatingMethodAccessorImpl.invoke(DelegatingMethodAcces sorImpl.java:43)

at java.lang.reflect.Method.invoke(Method.java:601)

at org.codehaus.groovy.reflection.CachedMethod.invoke(CachedMethod.java: 90)

… 69 more

Output with --debug:

C:\Documents and Settings\User\My Documents\jfxtras-labs>gradlew --debug uploadArchives 09:03:43.660 [DEBUG] [org.gradle.logging.internal.DefaultLoggingConfigurer] Finished configuring with level: DEBUG, configurers: [org.gradle.logging.internal.OutputEventRenderer@115632d, org.gradle.logging.internal.slf4j.Slf4jLoggingConfigurer@12221f 6, org.gradle.logging.internal.JavaUtilLoggingConfigurer@1e3bddb] 09:03:44.457 [DEBUG] [org.gradle.logging.internal.DefaultLoggingConfigurer] Finished configuring with level: DEBUG, configurers: [org.gradle.logging.internal.OutputEventRenderer@115632d, org.gradle.logging.internal.slf4j.Slf4jLoggingConfigurer@12221f 6, org.gradle.logging.internal.JavaUtilLoggingConfigurer@1e3bddb] 09:03:44.457 [INFO] [org.gradle.BuildLogger] Starting Build 09:03:44.457 [DEBUG] [org.gradle.BuildLogger] Gradle user home: C:\Documents and Settings\User.gradle 09:03:44.473 [DEBUG] [org.gradle.BuildLogger] Current dir: C:\Documents and Settings\User\My Documents\jfxtras-labs 09:03:44.473 [DEBUG] [org.gradle.BuildLogger] Settings file: null 09:03:44.473 [DEBUG] [org.gradle.BuildLogger] Build file: null 09:03:44.489 [DEBUG] [org.gradle.initialization.BuildSourceBuilder] Starting to build the build sources. 09:03:44.504 [DEBUG] [org.gradle.initialization.BuildSourceBuilder] Gradle source dir does not exist. We leave. 09:03:44.536 [DEBUG] [org.gradle.initialization.DefaultGradlePropertiesLoader] Found env project properties: [] 09:03:44.551 [DEBUG] [org.gradle.initialization.DefaultGradlePropertiesLoader] Found system project properties: [] 09:03:45.036 [DEBUG] [org.gradle.logging.internal.DefaultLoggingConfigurer] Finished configuring with level: DEBUG, configurers: [org.gradle.logging.internal.OutputEventRenderer@115632d, org.gradle.logging.internal.slf4j.Slf4jLoggingConfigurer@12221f 6, org.gradle.logging.internal.JavaUtilLoggingConfigurer@1e3bddb] 09:03:45.052 [DEBUG] [org.gradle.logging.internal.DefaultLoggingConfigurer] Finished configuring with level: DEBUG, configurers: [org.gradle.logging.internal.OutputEventRenderer@115632d, org.gradle.logging.internal.slf4j.Slf4jLoggingConfigurer@12221f 6, org.gradle.logging.internal.JavaUtilLoggingConfigurer@1e3bddb] 09:03:45.067 [DEBUG] [org.gradle.initialization.ScriptEvaluatingSettingsProcessor] Timing: Processing settings took: 0.5 secs 09:03:45.083 [INFO] [org.gradle.BuildLogger] Settings evaluated using empty settings script. 09:03:45.192 [DEBUG] [org.gradle.initialization.ProjectPropertySettingBuildLoader] Looking for project properties from: C:\Documents and Settings\User\My Documents\jfxtras-labs\gradle.properties 09:03:45.192 [DEBUG] [org.gradle.initialization.ProjectPropertySettingBuildLoader] Adding project properties (if not overwritten by user properties): [archivesBaseName, version, jfxtras_requiredJavaFxVersion, group, jfxtras_junitVersion] 09:03:45.239 [INFO] [org.gradle.BuildLogger] Projects loaded. Root project using build file ‘C:\Documents and Settings\User\My Documents\jfxtras-labs\build.gradle’. 09:03:45.239 [INFO] [org.gradle.BuildLogger] Included projects: [root project ‘jfxtras-labs’] 09:03:45.255 [INFO] [org.gradle.configuration.BuildScriptProcessor] Evaluating root project ‘jfxtras-labs’ using build file ‘C:\Documents and Settings\User\My Documents\jfxtras-labs\build.gradle’. 09:03:45.286 [DEBUG] [org.gradle.cache.internal.DefaultFileLockManager] Waiting to acquire shared lock on buildscript class cache for build file ‘C:\Documents and Settings\User\My Documents\jfxtras-labs\build.gradle’ (C:\Documents and Settings\User. gradle\caches\1.0-rc-3\scripts\build_1hef6d7en936clc8qfohdtgkrq\ProjectScript\buildscript). 09:03:45.302 [DEBUG] [org.gradle.cache.internal.DefaultFileLockManager] Lock acquired. 09:03:45.474 [QUIET] [system.out] JavaFX runtime jar: C:\Program Files\Oracle\javafx-sdk2.2.0-beta/rt/lib/jfxrt.jar 09:03:45.552 [DEBUG] [org.gradle.logging.internal.DefaultLoggingConfigurer] Finished configuring with level: DEBUG, configurers: [org.gradle.logging.internal.OutputEventRenderer@115632d, org.gradle.logging.internal.slf4j.Slf4jLoggingConfigurer@12221f 6, org.gradle.logging.internal.JavaUtilLoggingConfigurer@1e3bddb] 09:03:45.568 [DEBUG] [org.gradle.api.internal.artifacts.ivyservice.resolveengine.DefaultDependencyResolver] Resolving configuration ‘:classpath’ 09:03:45.599 [DEBUG] [org.gradle.api.internal.artifacts.ivyservice.IvyLoggingAdaper] setting ‘ivy.default.settings.dir’ to ‘jar:file:/C:/Documents%20and%20Settings/User/.gradle/wrapper/dists/gradle-1.0-rc-3-bin/59nkhr3nl96fm3u00sr182b0pj/gradle-1.0-r c-3/lib/ivy-2.2.0.jar!/org/apache/ivy/core/settings’ 09:03:45.615 [DEBUG] [org.gradle.api.internal.artifacts.ivyservice.IvyLoggingAdaper] setting ‘ivy.basedir’ to ‘C:\Documents and Settings\User\My Documents\jfxtras-labs.’ 09:03:45.630 [DEBUG] [org.gradle.api.internal.artifacts.ivyservice.IvyLoggingAdaper] setting ‘ivy.default.conf.dir’ to ‘jar:file:/C:/Documents%20and%20Settings/User/.gradle/wrapper/dists/gradle-1.0-rc-3-bin/59nkhr3nl96fm3u00sr182b0pj/gradle-1.0-rc-3/ lib/ivy-2.2.0.jar!/org/apache/ivy/core/settings’ 09:03:45.677 [DEBUG] [org.gradle.api.internal.artifacts.ivyservice.IvyLoggingAdaper] setting ‘java.runtime.name’ to ‘Java™ SE Runtime Environment’ 09:03:45.693 [DEBUG] [org.gradle.api.internal.artifacts.ivyservice.IvyLoggingAdaper] setting ‘sun.boot.library.path’ to ‘C:\Program Files\Java\jdk1.7.0_03\jre\bin’ 09:03:45.708 [DEBUG] [org.gradle.api.internal.artifacts.ivyservice.IvyLoggingAdaper] setting ‘java.vm.version’ to ‘22.1-b02’ 09:03:45.724 [DEBUG] [org.gradle.api.internal.artifacts.ivyservice.IvyLoggingAdaper] setting ‘java.vm.vendor’ to ‘Oracle Corporation’ 09:03:45.724 [DEBUG] [org.gradle.api.internal.artifacts.ivyservice.IvyLoggingAdaper] setting ‘java.vendor.url’ to ‘http://java.oracle.com/’ 09:03:45.740 [DEBUG] [org.gradle.api.internal.artifacts.ivyservice.IvyLoggingAdaper] setting ‘path.separator’ to ‘;’ 09:03:45.755 [DEBUG] [org.gradle.api.internal.artifacts.ivyservice.IvyLoggingAdaper] setting ‘java.vm.name’ to ‘Java HotSpot™ Client VM’ 09:03:45.771 [DEBUG] [org.gradle.api.internal.artifacts.ivyservice.IvyLoggingAdaper] setting ‘file.encoding.pkg’ to ‘sun.io’ 09:03:45.787 [DEBUG] [org.gradle.api.internal.artifacts.ivyservice.IvyLoggingAdaper] setting ‘user.country’ to ‘US’ 09:03:45.787 [DEBUG] [org.gradle.api.internal.artifacts.ivyservice.IvyLoggingAdaper] setting ‘user.script’ to ‘’ 09:03:45.802 [DEBUG] [org.gradle.api.internal.artifacts.ivyservice.IvyLoggingAdaper] setting ‘sun.java.launcher’ to ‘SUN_STANDARD’ 09:03:45.818 [DEBUG] [org.gradle.api.internal.artifacts.ivyservice.IvyLoggingAdaper] setting ‘sun.os.patch.level’ to ‘Service Pack 3’ 09:03:45.834 [DEBUG] [org.gradle.api.internal.artifacts.ivyservice.IvyLoggingAdaper] setting ‘java.vm.specification.name’ to ‘Java Virtual Machine Specification’ 09:03:45.849 [DEBUG] [org.gradle.api.internal.artifacts.ivyservice.IvyLoggingAdaper] setting ‘user.dir’ to ‘C:\Documents and Settings\User\My Documents\jfxtras-labs’ 09:03:45.865 [DEBUG] [org.gradle.api.internal.artifacts.ivyservice.IvyLoggingAdaper] setting ‘java.runtime.version’ to ‘1.7.0_03-b05’ 09:03:45.865 [DEBUG] [org.gradle.api.internal.artifacts.ivyservice.IvyLoggingAdaper] setting ‘java.awt.graphicsenv’ to ‘sun.awt.Win32GraphicsEnvironment’ 09:03:45.880 [DEBUG] [org.gradle.api.internal.artifacts.ivyservice.IvyLoggingAdaper] setting ‘java.endorsed.dirs’ to ‘C:\Program Files\Java\jdk1.7.0_03\jre\lib\endorsed’ 09:03:45.896 [DEBUG] [org.gradle.api.internal.artifacts.ivyservice.IvyLoggingAdaper] setting ‘os.arch’ to ‘x86’ 09:03:45.912 [DEBUG] [org.gradle.api.internal.artifacts.ivyservice.IvyLoggingAdaper] setting ‘java.io.tmpdir’ to ‘C:\DOCUME~1\User\LOCALS~1\Temp’ 09:03:45.927 [DEBUG] [org.gradle.api.internal.artifacts.ivyservice.IvyLoggingAdaper] setting ‘line.separator’ to ’ ’ 09:03:45.927 [DEBUG] [org.gradle.api.internal.artifacts.ivyservice.IvyLoggingAdaper] setting ‘org.gradle.appname’ to ‘gradlew’ 09:03:45.943 [DEBUG] [org.gradle.api.internal.artifacts.ivyservice.IvyLoggingAdaper] setting ‘java.vm.specification.vendor’ to ‘Oracle Corporation’ 09:03:45.959 [DEBUG] [org.gradle.api.internal.artifacts.ivyservice.IvyLoggingAdaper] setting ‘user.variant’ to ‘’ 09:03:45.974 [DEBUG] [org.gradle.api.internal.artifacts.ivyservice.IvyLoggingAdaper] setting ‘os.name’ to ‘Windows XP’ 09:03:45.990 [DEBUG] [org.gradle.api.internal.artifacts.ivyservice.IvyLoggingAdaper] setting ‘jna.boot.library.path’ to ‘C:\Documents and Settings\User.gradle\jna’ 09:03:45.990 [DEBUG] [org.gradle.api.internal.artifacts.ivyservice.IvyLoggingAdaper] setting ‘sun.jnu.encoding’ to ‘Cp1252’ 09:03:46.006 [DEBUG] [org.gradle.api.internal.artifacts.ivyservice.IvyLoggingAdaper] setting ‘java.library.path’ to ‘C:\Program Files\Java\jdk1.7.0_03\bin;C:\WINDOWS\Sun\Java\bin;C:\WINDOWS\system32;C:\WINDOWS;C:\WINDOWS\system32;C:\WINDOWS;C:\WINDOW S\System32\Wbem;C:\Program Files\Bazaar;C:\Program Files\Git\cmd;C:\Program Files\apache-maven-3.0.3\bin;C:\Program Files\Java\jdk1.7.0_03\bin;C:\Program Files\TortoiseHg;C:\Program Files\TortoiseGit\bin;C:\Program Files\GNU\GnuPG\pub;“C:\Program Fi les\apache-maven-3.0.3\bin”;“C:\Program Files\apache-ant-1.8.3\bin”;C:\Progra~1\TortoiseSVN\bin;C:\Progra~1\apache-maven-3.0.3\bin;C:\Progra~1\apache-ant-1.8.3\bin;.’ 09:03:46.021 [DEBUG] [org.gradle.api.internal.artifacts.ivyservice.IvyLoggingAdaper] setting ‘java.class.version’ to ‘51.0’ 09:03:46.037 [DEBUG] [org.gradle.api.internal.artifacts.ivyservice.IvyLoggingAdaper] setting ‘java.specification.name’ to ‘Java Platform API Specification’ 09:03:46.037 [DEBUG] [org.gradle.api.internal.artifacts.ivyservice.IvyLoggingAdaper] setting ‘sun.management.compiler’ to ‘HotSpot Client Compiler’ 09:03:46.052 [DEBUG] [org.gradle.api.internal.artifacts.ivyservice.IvyLoggingAdaper] setting ‘os.version’ to ‘5.1’ 09:03:46.068 [DEBUG] [org.gradle.api.internal.artifacts.ivyservice.IvyLoggingAdaper] setting ‘user.home’ to ‘C:\Documents and Settings\User’ 09:03:46.084 [DEBUG] [org.gradle.api.internal.artifacts.ivyservice.IvyLoggingAdaper] setting ‘user.timezone’ to ‘Europe/Berlin’ 09:03:46.099 [DEBUG] [org.gradle.api.internal.artifacts.ivyservice.IvyLoggingAdaper] setting ‘java.awt.printerjob’ to ‘sun.awt.windows.WPrinterJob’ 09:03:46.099 [DEBUG] [org.gradle.api.internal.artifacts.ivyservice.IvyLoggingAdaper] setting ‘java.specification.version’ to ‘1.7’ 09:03:46.115 [DEBUG] [org.gradle.api.internal.artifacts.ivyservice.IvyLoggingAdaper] setting ‘file.encoding’ to ‘Cp1252’ 09:03:46.131 [DEBUG] [org.gradle.api.internal.artifacts.ivyservice.IvyLoggingAdaper] setting ‘user.name’ to ‘User’ 09:03:46.146 [DEBUG] [org.gradle.api.internal.artifacts.ivyservice.IvyLoggingAdaper] setting ‘java.class.path’ to ‘C:\Documents and Settings\User\My Documents\jfxtras-labs\gradle\wrapper\gradle-wrapper.jar’ 09:03:46.146 [DEBUG] [org.gradle.api.internal.artifacts.ivyservice.IvyLoggingAdaper] setting ‘java.vm.specification.version’ to ‘1.7’ 09:03:46.162 [DEBUG] [org.gradle.api.internal.artifacts.ivyservice.IvyLoggingAdaper] setting ‘sun.arch.data.model’ to ‘32’ 09:03:46.178 [DEBUG] [org.gradle.api.internal.artifacts.ivyservice.IvyLoggingAdaper] setting ‘sun.java.command’ to ‘org.gradle.wrapper.GradleWrapperMain --debug uploadArchives’ 09:03:46.193 [DEBUG] [org.gradle.api.internal.artifacts.ivyservice.IvyLoggingAdaper] setting ‘java.home’ to ‘C:\Program Files\Java\jdk1.7.0_03\jre’ 09:03:46.209 [DEBUG] [org.gradle.api.internal.artifacts.ivyservice.IvyLoggingAdaper] setting ‘java.specification.vendor’


(Tom Eugelink) #2

Part of that log seems to be missing, here is the rest:

09:03:50.697 [DEBUG] [org.sonatype.maven.polyglot.groovy.builder.ModelBuilder] Registering factory: activation, factory: ChildFactory{name=‘activation’} 09:03:50.712 [DEBUG] [org.sonatype.maven.polyglot.groovy.builder.ModelBuilder] Registering factories for type: class org.apache.maven.model.Activation 09:03:50.728 [DEBUG] [org.sonatype.maven.polyglot.groovy.builder.ModelBuilder] Skipping setter with unsupported type: public void org.apache.maven.model.Activation.setActiveByDefault(boolean) 09:03:50.728 [DEBUG] [org.sonatype.maven.polyglot.groovy.builder.ModelBuilder] Registering factory: jdk, factory: StringFactory{name=‘jdk’} 09:03:50.743 [DEBUG] [org.sonatype.maven.polyglot.groovy.builder.ModelBuilder] Registering factory: os, factory: ChildFactory{name=‘os’} 09:03:50.759 [DEBUG] [org.sonatype.maven.polyglot.groovy.builder.ModelBuilder] Registering factories for type: class org.apache.maven.model.ActivationOS 09:03:50.775 [DEBUG] [org.sonatype.maven.polyglot.groovy.builder.ModelBuilder] Registering factory: arch, factory: StringFactory{name=‘arch’} 09:03:50.790 [DEBUG] [org.sonatype.maven.polyglot.groovy.builder.ModelBuilder] Registering factory: family, factory: StringFactory{name=‘family’} 09:03:50.790 [DEBUG] [org.sonatype.maven.polyglot.groovy.builder.ModelBuilder] Registering factory: property, factory: ChildFactory{name=‘property’} 09:03:50.806 [DEBUG] [org.sonatype.maven.polyglot.groovy.builder.ModelBuilder] Registering factories for type: class org.apache.maven.model.ActivationProperty 09:03:50.822 [DEBUG] [org.sonatype.maven.polyglot.groovy.builder.ModelBuilder] Registering factory: value, factory: StringFactory{name=‘value’} 09:03:50.837 [DEBUG] [org.sonatype.maven.polyglot.groovy.builder.ModelBuilder] Registering factory: file, factory: ChildFactory{name=‘file’} 09:03:50.853 [DEBUG] [org.sonatype.maven.polyglot.groovy.builder.ModelBuilder] Registering factories for type: class org.apache.maven.model.ActivationFile 09:03:50.869 [DEBUG] [org.sonatype.maven.polyglot.groovy.builder.ModelBuilder] Registering factory: exists, factory: StringFactory{name=‘exists’} 09:03:50.869 [DEBUG] [org.sonatype.maven.polyglot.groovy.builder.ModelBuilder] Registering factory: missing, factory: StringFactory{name=‘missing’} 09:03:50.884 [DEBUG] [org.sonatype.maven.polyglot.groovy.builder.ModelBuilder] Registering factory: source, factory: StringFactory{name=‘source’} 09:03:50.900 [DEBUG] [org.sonatype.maven.polyglot.groovy.builder.ModelBuilder] Registering factory: repository, factory: ChildFactory{name=‘repository’} 09:03:50.915 [WARN] [org.sonatype.maven.polyglot.groovy.builder.ModelBuilder] Duplicate factory: repository 09:03:50.931 [DEBUG] [org.sonatype.maven.polyglot.groovy.builder.ModelBuilder] Registering factories for type: class org.apache.maven.model.Repository 09:03:50.931 [DEBUG] [org.sonatype.maven.polyglot.groovy.builder.ModelBuilder] Registering factory: releases, factory: ChildFactory{name=‘releases’} 09:03:50.947 [DEBUG] [org.sonatype.maven.polyglot.groovy.builder.ModelBuilder] Registering factories for type: class org.apache.maven.model.RepositoryPolicy 09:03:50.962 [DEBUG] [org.sonatype.maven.polyglot.groovy.builder.ModelBuilder] Registering factory: checksumPolicy, factory: StringFactory{name=‘checksumPolicy’} 09:03:50.978 [DEBUG] [org.sonatype.maven.polyglot.groovy.builder.ModelBuilder] Skipping setter with unsupported type: public void org.apache.maven.model.RepositoryPolicy.setEnabled(boolean) 09:03:50.994 [DEBUG] [org.sonatype.maven.polyglot.groovy.builder.ModelBuilder] Registering factory: updatePolicy, factory: StringFactory{name=‘updatePolicy’} 09:03:51.009 [DEBUG] [org.sonatype.maven.polyglot.groovy.builder.ModelBuilder] Registering factory: snapshots, factory: ChildFactory{name=‘snapshots’} 09:03:51.009 [DEBUG] [org.sonatype.maven.polyglot.groovy.builder.ModelBuilder] Registering factory: pluginRepository, factory: ChildFactory{name=‘pluginRepository’} 09:03:51.025 [DEBUG] [org.sonatype.maven.polyglot.groovy.builder.ModelBuilder] Registering factory: project, factory: ModelFactory{name=‘project’} 09:03:51.041 [WARN] [org.sonatype.maven.polyglot.groovy.builder.ModelBuilder] Duplicate factory: project 09:03:51.056 [DEBUG] [groovy.util.FactoryBuilderSupport] For name: project created node: org.apache.maven.model.Model@28954f 09:03:51.072 [DEBUG] [groovy.util.FactoryBuilderSupport] For name: name created node: JFXtras Labs 09:03:51.087 [DEBUG] [groovy.util.FactoryBuilderSupport] For name: url created node: http://jfxtras.org 09:03:51.103 [DEBUG] [groovy.util.FactoryBuilderSupport] For name: description created node: Experimental components for JavaFX 2 09:03:51.119 [DEBUG] [groovy.util.FactoryBuilderSupport] For name: packaging created node: jar 09:03:51.134 [DEBUG] [groovy.util.FactoryBuilderSupport] For name: licenses created node: [] 09:03:51.150 [DEBUG] [groovy.util.FactoryBuilderSupport] For name: license created node: org.apache.maven.model.License@e3b6b7 09:03:51.166 [DEBUG] [groovy.util.FactoryBuilderSupport] For name: name created node: BSD 09:03:51.181 [DEBUG] [groovy.util.FactoryBuilderSupport] For name: url created node: http://www.opensource.org/licenses/bsd-license.php 09:03:51.197 [DEBUG] [groovy.util.FactoryBuilderSupport] For name: distribution created node: repo 09:03:51.213 [DEBUG] [groovy.util.FactoryBuilderSupport] For name: scm created node: org.apache.maven.model.Scm@1fd422c 09:03:51.228 [DEBUG] [groovy.util.FactoryBuilderSupport] For name: url created node: scm:git@github.com:jfxtras/jfxtras-labs.git 09:03:51.244 [DEBUG] [groovy.util.FactoryBuilderSupport] For name: connection created node: scm:git@github.com:jfxtras/jfxtras-labs.git 09:03:51.259 [DEBUG] [groovy.util.FactoryBuilderSupport] For name: developerConnection created node: scm:git@github.com:jfxtras/jfxtras-labs.git 09:03:51.275 [DEBUG] [groovy.util.FactoryBuilderSupport] For name: developers created node: [] 09:03:51.291 [DEBUG] [groovy.util.FactoryBuilderSupport] For name: developer created node: org.apache.maven.model.Developer@1021f42 09:03:51.306 [DEBUG] [groovy.util.FactoryBuilderSupport] For name: name created node: Stephen Chin 09:03:51.322 [DEBUG] [groovy.util.FactoryBuilderSupport] For name: developer created node: org.apache.maven.model.Developer@fdc252 09:03:51.338 [DEBUG] [groovy.util.FactoryBuilderSupport] For name: name created node: Dean Iverson 09:03:51.353 [DEBUG] [groovy.util.FactoryBuilderSupport] For name: developer created node: org.apache.maven.model.Developer@5d50ab 09:03:51.369 [DEBUG] [groovy.util.FactoryBuilderSupport] For name: name created node: Tom Eugelink 09:03:51.385 [DEBUG] [groovy.util.FactoryBuilderSupport] For name: developer created node: org.apache.maven.model.Developer@1191f35 09:03:51.400 [DEBUG] [groovy.util.FactoryBuilderSupport] For name: name created node: Jonathan Giles 09:03:51.416 [DEBUG] [groovy.util.FactoryBuilderSupport] For name: developer created node: org.apache.maven.model.Developer@1e6ee15 09:03:51.431 [DEBUG] [groovy.util.FactoryBuilderSupport] For name: name created node: Gerrit Grunwald 09:03:51.447 [DEBUG] [groovy.util.FactoryBuilderSupport] For name: developer created node: org.apache.maven.model.Developer@1a54190 09:03:51.463 [DEBUG] [groovy.util.FactoryBuilderSupport] For name: name created node: Thomas Bolz 09:03:51.478 [DEBUG] [org.gradle.logging.internal.DefaultLoggingConfigurer] Finished configuring with level: DEBUG, configurers: [org.gradle.logging.internal.OutputEventRenderer@115632d, org.gradle.logging.internal.slf4j.Slf4jLoggingConfigurer@12221f 6, org.gradle.logging.internal.JavaUtilLoggingConfigurer@1e3bddb] 09:03:51.541 [DEBUG] [org.gradle.logging.internal.DefaultLoggingConfigurer] Finished configuring with level: DEBUG, configurers: [org.gradle.logging.internal.OutputEventRenderer@115632d, org.gradle.logging.internal.slf4j.Slf4jLoggingConfigurer@12221f 6, org.gradle.logging.internal.JavaUtilLoggingConfigurer@1e3bddb] 09:03:51.557 [DEBUG] [org.gradle.configuration.BuildScriptProcessor] Timing: Running the build script took 6.286 secs 09:03:51.619 [INFO] [org.gradle.BuildLogger] All projects evaluated. 09:03:51.760 [DEBUG] [org.gradle.execution.DefaultTaskGraphExecuter] Timing: Creating the DAG took 0.078 secs 09:03:51.775 [INFO] [org.gradle.execution.TaskNameResolvingBuildConfigurationAction] Selected primary task ‘uploadArchives’ 09:03:51.775 [DEBUG] [org.gradle.cache.internal.DefaultFileLockManager] Waiting to acquire exclusive lock on task artifact state cache (C:\Documents and Settings\User\My Documents\jfxtras-labs.gradle\1.0-rc-3\taskArtifacts). 09:03:51.791 [DEBUG] [org.gradle.cache.internal.DefaultFileLockManager] Lock acquired. 09:03:51.807 [INFO] [org.gradle.BuildLogger] Tasks to be executed: [task ‘:compileJava’, task ‘:processResources’, task ‘:classes’, task ‘:javadoc’, task ‘:docJar’, task ‘:jar’, task ‘:sourcesJar’, task ‘:signArchives’, task ‘:uploadArchives’] 09:03:51.822 [LIFECYCLE] [org.gradle.TaskExecutionLogger] :compileJava 09:03:51.822 [DEBUG] [org.gradle.api.internal.tasks.execution.ExecuteAtMostOnceTaskExecuter] Starting to execute task ‘:compileJava’ 09:03:51.885 [DEBUG] [org.gradle.api.internal.tasks.execution.SkipUpToDateTaskExecuter] Determining if task ‘:compileJava’ is up-to-date 09:03:51.916 [DEBUG] [org.gradle.cache.internal.btree.BTreePersistentIndexedCache] Opening cache taskArtifacts.bin (C:\Documents and Settings\User\My Documents\jfxtras-labs.gradle\1.0-rc-3\taskArtifacts\taskArtifacts.bin) 09:03:51.947 [DEBUG] [org.gradle.api.internal.changedetection.DefaultFileCacheListener] Can cache files for configuration ‘:compile’ 09:03:51.963 [DEBUG] [org.gradle.api.internal.changedetection.DefaultFileCacheListener] Can cache files for directory ‘C:\Documents and Settings\User\My Documents\jfxtras-labs\src\main\java’ 09:03:51.979 [DEBUG] [org.gradle.api.internal.changedetection.DefaultFileCacheListener] Can cache files for file ‘C:\Documents and Settings\User\My Documents\jfxtras-labs\build\classes\main’ 09:03:51.979 [DEBUG] [org.gradle.api.internal.changedetection.DefaultFileCacheListener] Can cache files for file ‘C:\Documents and Settings\User\My Documents\jfxtras-labs\build\dependency-cache’ 09:03:51.994 [DEBUG] [org.gradle.cache.internal.btree.BTreePersistentIndexedCache] Opening cache outputFileStates.bin (C:\Documents and Settings\User\My Documents\jfxtras-labs.gradle\1.0-rc-3\taskArtifacts\outputFileStates.bin) 09:03:52.057 [DEBUG] [org.gradle.cache.internal.btree.BTreePersistentIndexedCache] Opening cache fileHashes.bin (C:\Documents and Settings\User\My Documents\jfxtras-labs.gradle\1.0-rc-3\taskArtifacts\fileHashes.bin) 09:03:52.229 [DEBUG] [org.gradle.api.internal.artifacts.ivyservice.resolveengine.DefaultDependencyResolver] Resolving configuration ‘:compile’ 09:03:52.276 [DEBUG] [org.gradle.api.internal.artifacts.ivyservice.resolveengine.DependencyGraphBuilder] Visiting configuration org.jfxtras#jfxtras-labs;2.2-r1-SNAPSHOT(compile). 09:03:52.291 [DEBUG] [org.gradle.api.internal.artifacts.ivyservice.resolveengine.DependencyGraphBuilder] Attaching org.jfxtras#jfxtras-labs;2.2-r1-SNAPSHOT(compile) to its parents. 09:03:52.370 [DEBUG] [org.gradle.cache.internal.btree.BTreePersistentIndexedCache] Opening cache fileSnapshots.bin (C:\Documents and Settings\User\My Documents\jfxtras-labs.gradle\1.0-rc-3\taskArtifacts\fileSnapshots.bin) 09:03:52.401 [INFO] [org.gradle.api.internal.changedetection.DefaultTaskArtifactStateRepository] Skipping task ‘:compileJava’ as it is up-to-date. 09:03:52.417 [INFO] [org.gradle.api.internal.tasks.execution.SkipUpToDateTaskExecuter] Skipping task ‘:compileJava’ as it is up-to-date 09:03:52.432 [DEBUG] [org.gradle.api.internal.tasks.execution.ExecuteAtMostOnceTaskExecuter] Finished executing task ‘:compileJava’ 09:03:52.448 [LIFECYCLE] [org.gradle.TaskExecutionLogger] :compileJava UP-TO-DATE 09:03:52.463 [LIFECYCLE] [org.gradle.TaskExecutionLogger] :processResources 09:03:52.463 [DEBUG] [org.gradle.api.internal.tasks.execution.ExecuteAtMostOnceTaskExecuter] Starting to execute task ‘:processResources’ 09:03:52.495 [DEBUG] [org.gradle.api.internal.tasks.execution.SkipUpToDateTaskExecuter] Determining if task ‘:processResources’ is up-to-date 09:03:52.510 [DEBUG] [org.gradle.api.internal.changedetection.DefaultFileCacheListener] Can cache files for directory ‘C:\Documents and Settings\User\My Documents\jfxtras-labs\src\main\resources’ 09:03:52.526 [DEBUG] [org.gradle.api.internal.changedetection.DefaultFileCacheListener] Can cache files for file ‘C:\Documents and Settings\User\My Documents\jfxtras-labs\build\resources\main’ 09:03:52.573 [INFO] [org.gradle.api.internal.changedetection.DefaultTaskArtifactStateRepository] Skipping task ‘:processResources’ as it is up-to-date. 09:03:52.589 [INFO] [org.gradle.api.internal.tasks.execution.SkipUpToDateTaskExecuter] Skipping task ‘:processResources’ as it is up-to-date 09:03:52.604 [DEBUG] [org.gradle.api.internal.tasks.execution.ExecuteAtMostOnceTaskExecuter] Finished executing task ‘:processResources’ 09:03:52.604 [LIFECYCLE] [org.gradle.TaskExecutionLogger] :processResources UP-TO-DATE 09:03:52.620 [LIFECYCLE] [org.gradle.TaskExecutionLogger] :classes 09:03:52.620 [DEBUG] [org.gradle.api.internal.tasks.execution.ExecuteAtMostOnceTaskExecuter] Starting to execute task ‘:classes’ 09:03:52.651 [INFO] [org.gradle.api.internal.tasks.execution.SkipTaskWithNoActionsExecuter] Skipping task ‘:classes’ as it has no actions. 09:03:52.667 [DEBUG] [org.gradle.api.internal.tasks.execution.ExecuteAtMostOnceTaskExecuter] Finished executing task ‘:classes’ 09:03:52.667 [LIFECYCLE] [org.gradle.TaskExecutionLogger] :classes UP-TO-DATE 09:03:52.682 [LIFECYCLE] [org.gradle.TaskExecutionLogger] :javadoc 09:03:52.682 [DEBUG] [org.gradle.api.internal.tasks.execution.ExecuteAtMostOnceTaskExecuter] Starting to execute task ‘:javadoc’ 09:03:52.714 [DEBUG] [org.gradle.api.internal.tasks.execution.SkipUpToDateTaskExecuter] Determining if task ‘:javadoc’ is up-to-date 09:03:52.729 [DEBUG] [org.gradle.api.internal.changedetection.DefaultFileCacheListener] Can cache files for file ‘C:\Documents and Settings\User\My Documents\jfxtras-labs\build\classes\main’ 09:03:52.745 [DEBUG] [org.gradle.api.internal.changedetection.DefaultFileCacheListener] Can cache files for file ‘C:\Documents and Settings\User\My Documents\jfxtras-labs\build\resources\main’ 09:03:52.761 [DEBUG] [org.gradle.api.internal.changedetection.DefaultFileCacheListener] Can cache files for configuration ‘:compile’ 09:03:52.761 [DEBUG] [org.gradle.api.internal.changedetection.DefaultFileCacheListener] Can cache files for directory ‘C:\Documents and Settings\User\My Documents\jfxtras-labs\src\main\java’ 09:03:52.776 [DEBUG] [org.gradle.api.internal.changedetection.DefaultFileCacheListener] Can cache files for file ‘C:\Documents and Settings\User\My Documents\jfxtras-labs\build\docs\javadoc’ 09:03:53.136 [INFO] [org.gradle.api.internal.changedetection.DefaultTaskArtifactStateRepository] Skipping task ‘:javadoc’ as it is up-to-date. 09:03:53.136 [INFO] [org.gradle.api.internal.tasks.execution.SkipUpToDateTaskExecuter] Skipping task ‘:javadoc’ as it is up-to-date 09:03:53.151 [DEBUG] [org.gradle.api.internal.tasks.execution.ExecuteAtMostOnceTaskExecuter] Finished executing task ‘:javadoc’ 09:03:53.167 [LIFECYCLE] [org.gradle.TaskExecutionLogger] :javadoc UP-TO-DATE 09:03:53.183 [LIFECYCLE] [org.gradle.TaskExecutionLogger] :docJar 09:03:53.183 [DEBUG] [org.gradle.api.internal.tasks.execution.ExecuteAtMostOnceTaskExecuter] Starting to execute task ‘:docJar’ 09:03:53.214 [DEBUG] [org.gradle.api.internal.tasks.execution.SkipUpToDateTaskExecuter] Determining if task ‘:docJar’ is up-to-date 09:03:53.230 [DEBUG] [org.gradle.api.internal.changedetection.DefaultFileCacheListener] Can cache files for file tree 09:03:53.230 [DEBUG] [org.gradle.api.internal.changedetection.DefaultFileCacheListener] Can cache files for directory ‘C:\Documents and Settings\User\My Documents\jfxtras-labs\build\docs\javadoc’ 09:03:53.245 [DEBUG] [org.gradle.api.internal.changedetection.DefaultFileCacheListener] Can cache files for file ‘C:\Documents and Settings\User\My Documents\jfxtras-labs\build\libs\jfxtras-labs-2.2-r1-SNAPSHOT-javadoc.jar’ 09:03:53.370 [INFO] [org.gradle.api.internal.changedetection.DefaultTaskArtifactStateRepository] Skipping task ‘:docJar’ as it is up-to-date. 09:03:53.386 [INFO] [org.gradle.api.internal.tasks.execution.SkipUpToDateTaskExecuter] Skipping task ‘:docJar’ as it is up-to-date 09:03:53.402 [DEBUG] [org.gradle.api.internal.tasks.execution.ExecuteAtMostOnceTaskExecuter] Finished executing task ‘:docJar’ 09:03:53.417 [LIFECYCLE] [org.gradle.TaskExecutionLogger] :docJar UP-TO-DATE 09:03:53.417 [LIFECYCLE] [org.gradle.TaskExecutionLogger] :jar 09:03:53.417 [DEBUG] [org.gradle.api.internal.tasks.execution.ExecuteAtMostOnceTaskExecuter] Starting to execute task ‘:jar’ 09:03:53.449 [DEBUG] [org.gradle.api.internal.tasks.execution.SkipUpToDateTaskExecuter] Determining if task ‘:jar’ is up-to-date 09:03:53.464 [DEBUG] [org.gradle.api.internal.changedetection.DefaultFileCacheListener] Can cache files for file tree 09:03:53.480 [DEBUG] [org.gradle.api.internal.changedetection.DefaultFileCacheListener] Can cache files for directory ‘C:\Documents and Settings\User\My Documents\jfxtras-labs\build\classes\main’ 09:03:53.496 [DEBUG] [org.gradle.api.internal.changedetection.DefaultFileCacheListener] Can cache files for directory ‘C:\Documents and Settings\User\My Documents\jfxtras-labs\build\resources\main’ 09:03:53.511 [DEBUG] [org.gradle.api.internal.changedetection.DefaultFileCacheListener] Can cache files for file ‘C:\Documents and Settings\User\My Documents\jfxtras-labs\build\libs\jfxtras-labs-2.2-r1-SNAPSHOT.jar’ 09:03:53.683 [INFO] [org.gradle.api.internal.changedetection.DefaultTaskArtifactStateRepository] Skipping task ‘:jar’ as it is up-to-date. 09:03:53.699 [INFO] [org.gradle.api.internal.tasks.execution.SkipUpToDateTaskExecuter] Skipping task ‘:jar’ as it is up-to-date 09:03:53.714 [DEBUG] [org.gradle.api.internal.tasks.execution.ExecuteAtMostOnceTaskExecuter] Finished executing task ‘:jar’ 09:03:53.730 [LIFECYCLE] [org.gradle.TaskExecutionLogger] :jar UP-TO-DATE 09:03:53.746 [LIFECYCLE] [org.gradle.TaskExecutionLogger] :sourcesJar 09:03:53.746 [DEBUG] [org.gradle.api.internal.tasks.execution.ExecuteAtMostOnceTaskExecuter] Starting to execute task ‘:sourcesJar’ 09:03:53.761 [DEBUG] [org.gradle.api.internal.tasks.execution.SkipUpToDateTaskExecuter] Determining if task ‘:sourcesJar’ is up-to-date 09:03:53.777 [DEBUG] [org.gradle.api.internal.changedetection.DefaultFileCacheListener] Can cache files for file tree 09:03:53.793 [DEBUG] [org.gradle.api.internal.changedetection.DefaultFileCacheListener] Can cache files for directory ‘C:\Documents and Settings\User\My Documents\jfxtras-labs\src\main\resources’ 09:03:53.808 [DEBUG] [org.gradle.api.internal.changedetection.DefaultFileCacheListener] Can cache files for directory ‘C:\Documents and Settings\User\My Documents\jfxtras-labs\src\main\java’ 09:03:53.824 [DEBUG] [org.gradle.api.internal.changedetection.DefaultFileCacheListener] Can cache files for file ‘C:\Documents and Settings\User\My Documents\jfxtras-labs\build\libs\jfxtras-labs-2.2-r1-SNAPSHOT-sources.jar’ 09:03:53.918 [INFO] [org.gradle.api.internal.changedetection.DefaultTaskArtifactStateRepository] Skipping task ‘:sourcesJar’ as it is up-to-date. 09:03:53.918 [INFO] [org.gradle.api.internal.tasks.execution.SkipUpToDateTaskExecuter] Skipping task ‘:sourcesJar’ as it is up-to-date 09:03:53.933 [DEBUG] [org.gradle.api.internal.tasks.execution.ExecuteAtMostOnceTaskExecuter] Finished executing task ‘:sourcesJar’ 09:03:53.949 [LIFECYCLE] [org.gradle.TaskExecutionLogger] :sourcesJar UP-TO-DATE 09:03:53.965 [LIFECYCLE] [org.gradle.TaskExecutionLogger] :signArchives 09:03:53.965 [DEBUG] [org.gradle.api.internal.tasks.execution.ExecuteAtMostOnceTaskExecuter] Starting to execute task ‘:signArchives’ 09:03:53.996 [DEBUG] [org.gradle.api.internal.tasks.execution.SkipUpToDateTaskExecuter] Determining if task ‘:signArchives’ is up-to-date 09:03:53.996 [DEBUG] [org.gradle.api.internal.changedetection.DefaultFileCacheListener] Can cache files for file ‘C:\Documents and Settings\User\My Documents\jfxtras-labs\build\libs\jfxtras-labs-2.2-r1-SNAPSHOT.jar’ 09:03:54.012 [DEBUG] [org.gradle.api.internal.changedetection.DefaultFileCacheListener] Can cache files for file ‘C:\Documents and Settings\User\My Documents\jfxtras-labs\build\libs\jfxtras-labs-2.2-r1-SNAPSHOT.jar’ 09:03:54.027 [DEBUG] [org.gradle.api.internal.changedetection.DefaultFileCacheListener] Can cache files for file ‘C:\Documents and Settings\User\My Documents\jfxtras-labs\build\libs\jfxtras-labs-2.2-r1-SNAPSHOT-javadoc.jar’ 09:03:54.043 [DEBUG] [org.gradle.api.internal.changedetection.DefaultFileCacheListener] Can cache files for file ‘C:\Documents and Settings\User\My Documents\jfxtras-labs\build\libs\jfxtras-labs-2.2-r1-SNAPSHOT-sources.jar’ 09:03:54.058 [DEBUG] [org.gradle.api.internal.changedetection.DefaultFileCacheListener] Can cache files for file ‘C:\Documents and Settings\User\My Documents\jfxtras-labs\build\libs\jfxtras-labs-2.2-r1-SNAPSHOT.jar’ 09:03:54.074 [DEBUG] [org.gradle.api.internal.changedetection.DefaultFileCacheListener] Can cache files for file ‘C:\Documents and Settings\User\My Documents\jfxtras-labs\build\libs\jfxtras-labs-2.2-r1-SNAPSHOT.jar’ 09:03:54.074 [DEBUG] [org.gradle.api.internal.changedetection.DefaultFileCacheListener] Can cache files for file ‘C:\Documents and Settings\User\My Documents\jfxtras-labs\build\libs\jfxtras-labs-2.2-r1-SNAPSHOT-javadoc.jar’ 09:03:54.090 [DEBUG] [org.gradle.api.internal.changedetection.DefaultFileCacheListener] Can cache files for file ‘C:\Documents and Settings\User\My Documents\jfxtras-labs\build\libs\jfxtras-labs-2.2-r1-SNAPSHOT-sources.jar’ 09:03:54.746 [DEBUG] [org.gradle.api.internal.tasks.execution.ExecuteAtMostOnceTaskExecuter] Finished executing task ‘:signArchives’ 09:03:54.778 [ERROR] [org.gradle.BuildExceptionReporter] 09:03:54.778 [ERROR] [org.gradle.BuildExceptionReporter] FAILURE: Build aborted because of an internal error. 09:03:54.793 [ERROR] [org.gradle.BuildExceptionReporter] 09:03:54.809 [ERROR] [org.gradle.BuildExceptionReporter] * What went wrong: 09:03:54.825 [ERROR] [org.gradle.BuildExceptionReporter] Build aborted because of an unexpected internal error. Please file an issue at: http://forums.gradle.org. 09:03:54.825 [LIFECYCLE] [org.gradle.BuildResultLogger] 09:03:54.840 [LIFECYCLE] [org.gradle.BuildResultLogger] BUILD FAILED 09:03:54.856 [LIFECYCLE] [org.gradle.BuildResultLogger] 09:03:54.872 [LIFECYCLE] [org.gradle.BuildResultLogger] Total time: 11.65 secs 09:03:54.872 [DEBUG] [org.gradle.cache.internal.btree.BTreePersistentIndexedCache] Closing cache fileSnapshots.bin (C:\Documents and Settings\User\My Documents\jfxtras-labs.gradle\1.0-rc-3\taskArtifacts\fileSnapshots.bin) 09:03:54.887 [DEBUG] [org.gradle.cache.internal.btree.BTreePersistentIndexedCache] Closing cache fileHashes.bin (C:\Documents and Settings\User\My Documents\jfxtras-labs.gradle\1.0-rc-3\taskArtifacts\fileHashes.bin) 09:03:54.903 [DEBUG] [org.gradle.cache.internal.btree.BTreePersistentIndexedCache] Closing cache outputFileStates.bin (C:\Documents and Settings\User\My Documents\jfxtras-labs.gradle\1.0-rc-3\taskArtifacts\outputFileStates.bin) 09:03:54.918 [DEBUG] [org.gradle.cache.internal.btree.BTreePersistentIndexedCache] Closing cache taskArtifacts.bin (C:\Documents and Settings\User\My Documents\jfxtras-labs.gradle\1.0-rc-3\taskArtifacts\taskArtifacts.bin) 09:03:54.934 [DEBUG] [org.gradle.cache.internal.DefaultFileLockManager] Releasing lock on task artifact state cache (C:\Documents and Settings\User\My Documents\jfxtras-labs.gradle\1.0-rc-3\taskArtifacts). 09:03:54.950 [DEBUG] [org.gradle.cache.internal.DefaultFileLockManager] Releasing lock on no_buildscript class cache for script ‘C:\Documents and Settings\User\My Documents\jfxtras-labs\gradle\mavenCentralDeploy.gradle’ (C:\Documents and Settings\Use r.gradle\caches\1.0-rc-3\scripts\mavenCentralDeploy_2l5t88qhie7bsdsp35rdodolol\DefaultScript\no_buildscript). 09:03:54.965 [DEBUG] [org.gradle.cache.internal.DefaultFileLockManager] Releasing lock on buildscript class cache for script ‘C:\Documents and Settings\User\My Documents\jfxtras-labs\gradle\mavenCentralDeploy.gradle’ (C:\Documents and Settings\User. gradle\caches\1.0-rc-3\scripts\mavenCentralDeploy_2l5t88qhie7bsdsp35rdodolol\DefaultScript\buildscript). 09:03:54.965 [DEBUG] [org.gradle.cache.internal.DefaultFileLockManager] Releasing lock on no_buildscript class cache for build file ‘C:\Documents and Settings\User\My Documents\jfxtras-labs\build.gradle’ (C:\Documents and Settings\User.gradle\caches \1.0-rc-3\scripts\build_1hef6d7en936clc8qfohdtgkrq\ProjectScript\no_buildscript). 09:03:54.981 [DEBUG] [org.gradle.cache.internal.DefaultFileLockManager] Releasing lock on buildscript class cache for build file ‘C:\Documents and Settings\User\My Documents\jfxtras-labs\build.gradle’ (C:\Documents and Settings\User.gradle\caches\1. 0-rc-3\scripts\build_1hef6d7en936clc8qfohdtgkrq\ProjectScript\buildscript). 09:03:54.997 [DEBUG] [org.gradle.logging.internal.DefaultLoggingConfigurer] Finished configuring with level: DEBUG, configurers: [org.gradle.logging.internal.OutputEventRenderer@115632d, org.gradle.logging.internal.slf4j.Slf4jLoggingConfigurer@12221f 6, org.gradle.logging.internal.JavaUtilLoggingConfigurer@1e3bddb]

C:\Documents and Settings\User\My Documents\jfxtras-labs>


(Peter Niederwieser) #3

According to this thread, this exception can occur if you specified the wrong passphrase (i.e. ‘signing.password’) or didn’t specify a passphrase at all. At this point I don’t think this truly is an internal Gradle error.


(Tom Eugelink) #4

Correct. It indeed was a wrong passphrase. BouncyCastle probably should generate a better exception.