When ı run my flutter project, ı did get this errorr "Gradle task assembleDebug failed with exit code 1"

How can ı fix this mistake ??

FAILURE: Build failed with an exception.

  • What went wrong:
    Execution failed for task ‘:app:transformClassesWithDexBuilderForDebug’.

com.android.build.api.transform.TransformException: com.android.builder.dexing.DexArchiveBuilderException: com.android.builder.dexing.DexArchiveBuilderException: Failed to process C:\Users\Ali Demircan.gradle\caches\transforms-1\files-1.1\flutter.jar\026bbda59c2aed103cf5761f5ac2ebd6\jetified-flutter.jar

  • Try:
    Run with --stacktrace option to get the stack trace. Run with --info or --debug option to get more log output. Run with --scan to get full insights.

  • Get more help at https://help.gradle.org

Gradle task assembleDebug failed with exit code 1