Unexpected exception thrown. org.gradle.messaging.remote.internal.MessageIOException: Could not read message from '/0


(Sherry Ba) #1

:codeQuality:codeQuality :codeQuality:configureIntegTest :codeQuality:integTest Unexpected exception thrown. org.gradle.messaging.remote.internal.MessageIOException: Could not read message from ‘/0:0:0:0:0:0:0:1:56589’.

at org.gradle.messaging.remote.internal.inet.SocketConnection.receive(SocketConnection.java:88)

at org.gradle.messaging.remote.internal.hub.MessageHub$ConnectionReceive.run(MessageHub.java:230)

at org.gradle.internal.concurrent.DefaultExecutorFactory$StoppableExecutorImpl$1.run(DefaultExecutorFactory.java:66)

at java.util.concurrent.ThreadPoolExecutor.runWorker(ThreadPoolExecutor.java:1145)

at java.util.concurrent.ThreadPoolExecutor$Worker.run(ThreadPoolExecutor.java:615)

at java.lang.Thread.run(Thread.java:724) Caused by: com.esotericsoftware.kryo.KryoException: Buffer underflow.

at com.esotericsoftware.kryo.io.Input.require(Input.java:162)

at com.esotericsoftware.kryo.io.Input.readByte(Input.java:255)

at org.gradle.messaging.remote.internal.hub.InterHubMessageSerializer$MessageReader.read(InterHubMessageSerializer.java:64)

at org.gradle.messaging.remote.internal.hub.InterHubMessageSerializer$MessageReader.read(InterHubMessageSerializer.java:53)

at org.gradle.messaging.remote.internal.inet.SocketConnection.receive(SocketConnection.java:83)

… 5 more Unexpected exception thrown. org.gradle.messaging.remote.internal.MessageIOException: Could not read message from ‘/0:0:0:0:0:0:0:1:51761’.

at org.gradle.messaging.remote.internal.inet.SocketConnection.receive(SocketConnection.java:88)

at org.gradle.messaging.remote.internal.hub.MessageHub$ConnectionReceive.run(MessageHub.java:230)

at org.gradle.internal.concurrent.DefaultExecutorFactory$StoppableExecutorImpl$1.run(DefaultExecutorFactory.java:66)

at java.util.concurrent.ThreadPoolExecutor.runWorker(ThreadPoolExecutor.java:1145)

at java.util.concurrent.ThreadPoolExecutor$Worker.run(ThreadPoolExecutor.java:615)

at java.lang.Thread.run(Thread.java:724) Caused by: com.esotericsoftware.kryo.KryoException: Buffer underflow.

at com.esotericsoftware.kryo.io.Input.require(Input.java:162)

at com.esotericsoftware.kryo.io.Input.readByte(Input.java:255)

at org.gradle.messaging.remote.internal.hub.InterHubMessageSerializer$MessageReader.read(InterHubMessageSerializer.java:64)

at org.gradle.messaging.remote.internal.hub.InterHubMessageSerializer$MessageReader.read(InterHubMessageSerializer.java:53)

at org.gradle.messaging.remote.internal.inet.SocketConnection.receive(SocketConnection.java:83)

… 5 more :codeQuality:integTest FAILED

FAILURE: Build failed with an exception.

  • What went wrong: Execution failed for task ‘:codeQuality:integTest’. > Process ‘Gradle Worker 22’ finished with non-zero exit value 137

  • Try: Run with --stacktrace option to get the stack trace. Run with --info or --debug option to get more log output.

BUILD FAILED

Total time: 10 mins 24.4 secs

FAILURE: Build failed with an exception.

  • What went wrong: Failed to notify build listener.

  • Try: Run with --stacktrace option to get the stack trace. Run with --info or --debug option to get more log output.


IllegalArgumentException in internal Gradle classes
(Peter Niederwieser) #2

A possible cause is that a test JVM ran out of memory. See the Gradle Build Language Reference for the ‘Test’ task for how to increase memory.