Task :app:processDebugMainManifest FAILED raect antive error

Task :app:processDebugMainManifest FAILED
Error ‘D:\projects\react\New folder\new\awesome\android\app\build\outputs\logs\manifest-merger-debug-report.txt (Access is denied)’ while writing the merger report file, build can continue but merging activities will not be documented
11 actionable tasks: 11 executed

FAILURE: Build failed with an exception.

  • What went wrong:
    Execution failed for task ‘:app:processDebugMainManifest’.

java.io.FileNotFoundException: D:\projects\react\New folder\new\awesome\android\app\build\intermediates\manifest_merge_blame_file\debug\manifest-merger-blame-debug-report.txt (Access is denied)

  • Try:
    Run with --stacktrace option to get the stack trace. Run with --info or --debug option to get more log output. Run with --scan to get full insights.

  • Get more help at https://help.gradle.org


error Failed to install the app. Make sure you have the Android development environment set up: Setting up the development environment · React Native.
Error: Command failed: gradlew.bat app:installDebug -PreactNativeDevServerPort=8081