Synchronize Gradle projects with workspace failed due to an error in the referenced Gradle build


(Bruce B) #1

Hi. I am not a developer, and do not know how to read buildscripts. I am learning so I can be a saavy PM. I did the steps pasted below to update my gradle project dependencies. Is anyone patient enough to help me?

Step 1. Right-click “Basic java Project,” and select Gradle > Refresh Gradle Project.
The Progress bar got to ‘:classpath’.

Step 2. The error appeared.

Step 3. Clicked the “Copy the failure details to the clipboard” button, and pasted them below.

Synchronize Gradle projects with workspace failed due to an error in the referenced Gradle build.
Could not run build action using Gradle distribution ‘https://services.gradle.org/distributions/gradle-3.5-bin.zip’.

A problem occurred configuring root project ‘Basic Java Project’.
java.net.ConnectException: Connection timed out: connect
Connection timed out: connect
org.gradle.tooling.BuildException: Could not run build action using Gradle distribution ‘https://services.gradle.org/distributions/gradle-3.5-bin.zip’.
at org.gradle.tooling.internal.consumer.ExceptionTransformer.transform(ExceptionTransformer.java:51)
at org.gradle.tooling.internal.consumer.ExceptionTransformer.transform(ExceptionTransformer.java:29)
at org.gradle.tooling.internal.consumer.ResultHandlerAdapter.onFailure(ResultHandlerAdapter.java:41)
at org.gradle.tooling.internal.consumer.async.DefaultAsyncConsumerActionExecutor$1$1.run(DefaultAsyncConsumerActionExecutor.java:57)
at org.gradle.internal.concurrent.ExecutorPolicy$CatchAndRecordFailures.onExecute(ExecutorPolicy.java:63)
at org.gradle.internal.concurrent.StoppableExecutorImpl$1.run(StoppableExecutorImpl.java:46)
at java.util.concurrent.ThreadPoolExecutor.runWorker(Unknown Source)
at java.util.concurrent.ThreadPoolExecutor$Worker.run(Unknown Source)
at java.lang.Thread.run(Unknown Source)
at org.gradle.tooling.internal.consumer.BlockingResultHandler.getResult(BlockingResultHandler.java:46)
at org.gradle.tooling.internal.consumer.DefaultBuildActionExecuter.run(DefaultBuildActionExecuter.java:60)
at sun.reflect.NativeMethodAccessorImpl.invoke0(Native Method)
at sun.reflect.NativeMethodAccessorImpl.invoke(Unknown Source)
at sun.reflect.DelegatingMethodAccessorImpl.invoke(Unknown Source)
at java.lang.reflect.Method.invoke(Unknown Source)
at org.eclipse.buildship.core.workspace.internal.ConnectionAwareLauncherProxy.invokeRun(ConnectionAwareLauncherProxy.java:170)
at org.eclipse.buildship.core.workspace.internal.ConnectionAwareLauncherProxy.invoke(ConnectionAwareLauncherProxy.java:160)
at com.sun.proxy.$Proxy33.run(Unknown Source)
at org.eclipse.buildship.core.workspace.internal.DefaultModelProvider$1.get(DefaultModelProvider.java:112)
at org.eclipse.buildship.core.workspace.internal.DefaultModelProvider$3.call(DefaultModelProvider.java:142)
at com.google.common.cache.LocalCache$LocalManualCache$1.load(LocalCache.java:4724)
at com.google.common.cache.LocalCache$LoadingValueReference.loadFuture(LocalCache.java:3522)
at com.google.common.cache.LocalCache$Segment.loadSync(LocalCache.java:2315)
at com.google.common.cache.LocalCache$Segment.lockedGetOrLoad(LocalCache.java:2278)
at com.google.common.cache.LocalCache$Segment.get(LocalCache.java:2193)
at com.google.common.cache.LocalCache.get(LocalCache.java:3932)
at com.google.common.cache.LocalCache$LocalManualCache.get(LocalCache.java:4721)
at org.eclipse.buildship.core.workspace.internal.DefaultModelProvider.getFromCache(DefaultModelProvider.java:153)
at org.eclipse.buildship.core.workspace.internal.DefaultModelProvider.executeOperation(DefaultModelProvider.java:138)
at org.eclipse.buildship.core.workspace.internal.DefaultModelProvider.executeBuildActionExecuter(DefaultModelProvider.java:108)
at org.eclipse.buildship.core.workspace.internal.DefaultModelProvider.fetchModels(DefaultModelProvider.java:78)
at org.eclipse.buildship.core.workspace.internal.DefaultModelProvider.fetchEclipseGradleProjects(DefaultModelProvider.java:99)
at org.eclipse.buildship.core.workspace.internal.SynchronizeGradleBuildsJob.fetchEclipseProjects(SynchronizeGradleBuildsJob.java:91)
at org.eclipse.buildship.core.workspace.internal.SynchronizeGradleBuildsJob.synchronizeBuild(SynchronizeGradleBuildsJob.java:81)
at org.eclipse.buildship.core.workspace.internal.SynchronizeGradleBuildsJob.runToolingApiJob(SynchronizeGradleBuildsJob.java:73)
at org.eclipse.buildship.core.util.progress.ToolingApiJob$1.run(ToolingApiJob.java:73)
at org.eclipse.buildship.core.util.progress.ToolingApiInvoker.invoke(ToolingApiInvoker.java:62)
at org.eclipse.buildship.core.util.progress.ToolingApiJob.run(ToolingApiJob.java:70)
at org.eclipse.core.internal.jobs.Worker.run(Worker.java:56)
Caused by: org.gradle.internal.exceptions.LocationAwareException: A problem occurred configuring root project ‘Basic Java Project’.
at org.gradle.initialization.DefaultExceptionAnalyser.transform(DefaultExceptionAnalyser.java:74)
at org.gradle.initialization.MultipleBuildFailuresExceptionAnalyser.transform(MultipleBuildFailuresExceptionAnalyser.java:47)
at org.gradle.initialization.StackTraceSanitizingExceptionAnalyser.transform(StackTraceSanitizingExceptionAnalyser.java:30)
at org.gradle.initialization.DefaultGradleLauncher.doBuild(DefaultGradleLauncher.java:114)
at org.gradle.initialization.DefaultGradleLauncher.getBuildAnalysis(DefaultGradleLauncher.java:100)
at org.gradle.launcher.exec.GradleBuildController.configure(GradleBuildController.java:74)
at org.gradle.tooling.internal.provider.runner.ClientProvidedBuildActionRunner.run(ClientProvidedBuildActionRunner.java:65)
at org.gradle.launcher.exec.ChainingBuildActionRunner.run(ChainingBuildActionRunner.java:35)
at org.gradle.tooling.internal.provider.runner.RunAsBuildOperationBuildActionRunner$1.execute(RunAsBuildOperationBuildActionRunner.java:43)
at org.gradle.tooling.internal.provider.runner.RunAsBuildOperationBuildActionRunner$1.execute(RunAsBuildOperationBuildActionRunner.java:40)
at org.gradle.internal.Transformers$4.transform(Transformers.java:169)
at org.gradle.internal.progress.DefaultBuildOperationExecutor.run(DefaultBuildOperationExecutor.java:106)
at org.gradle.internal.progress.DefaultBuildOperationExecutor.run(DefaultBuildOperationExecutor.java:56)
at org.gradle.tooling.internal.provider.runner.RunAsBuildOperationBuildActionRunner.run(RunAsBuildOperationBuildActionRunner.java:40)
at org.gradle.tooling.internal.provider.runner.SubscribableBuildActionRunner.run(SubscribableBuildActionRunner.java:88)
at org.gradle.launcher.exec.ChainingBuildActionRunner.run(ChainingBuildActionRunner.java:35)
at org.gradle.launcher.exec.InProcessBuildActionExecuter.execute(InProcessBuildActionExecuter.java:41)
at org.gradle.launcher.exec.InProcessBuildActionExecuter.execute(InProcessBuildActionExecuter.java:26)
at org.gradle.tooling.internal.provider.ContinuousBuildActionExecuter.execute(ContinuousBuildActionExecuter.java:75)
at org.gradle.tooling.internal.provider.ContinuousBuildActionExecuter.execute(ContinuousBuildActionExecuter.java:49)
at org.gradle.tooling.internal.provider.ServicesSetupBuildActionExecuter.execute(ServicesSetupBuildActionExecuter.java:49)
at org.gradle.tooling.internal.provider.ServicesSetupBuildActionExecuter.execute(ServicesSetupBuildActionExecuter.java:31)
at org.gradle.launcher.daemon.server.exec.ExecuteBuild.doBuild(ExecuteBuild.java:67)
at org.gradle.launcher.daemon.server.exec.BuildCommandOnly.execute(BuildCommandOnly.java:36)
at org.gradle.launcher.daemon.server.api.DaemonCommandExecution.proceed(DaemonCommandExecution.java:120)
at org.gradle.launcher.daemon.server.exec.WatchForDisconnection.execute(WatchForDisconnection.java:37)
at org.gradle.launcher.daemon.server.api.DaemonCommandExecution.proceed(DaemonCommandExecution.java:120)
at org.gradle.launcher.daemon.server.exec.ResetDeprecationLogger.execute(ResetDeprecationLogger.java:26)
at org.gradle.launcher.daemon.server.api.DaemonCommandExecution.proceed(DaemonCommandExecution.java:120)
at org.gradle.launcher.daemon.server.exec.RequestStopIfSingleUsedDaemon.execute(RequestStopIfSingleUsedDaemon.java:34)
at org.gradle.launcher.daemon.server.api.DaemonCommandExecution.proceed(DaemonCommandExecution.java:120)
at org.gradle.launcher.daemon.server.exec.ForwardClientInput$2.call(ForwardClientInput.java:74)
at org.gradle.launcher.daemon.server.exec.ForwardClientInput$2.call(ForwardClientInput.java:72)
at org.gradle.util.Swapper.swap(Swapper.java:38)
at org.gradle.launcher.daemon.server.exec.ForwardClientInput.execute(ForwardClientInput.java:72)
at org.gradle.launcher.daemon.server.api.DaemonCommandExecution.proceed(DaemonCommandExecution.java:120)
at org.gradle.launcher.daemon.server.exec.LogAndCheckHealth.execute(LogAndCheckHealth.java:55)
at org.gradle.launcher.daemon.server.api.DaemonCommandExecution.proceed(DaemonCommandExecution.java:120)
at org.gradle.launcher.daemon.server.exec.LogToClient.doBuild(LogToClient.java:60)
at org.gradle.launcher.daemon.server.exec.BuildCommandOnly.execute(BuildCommandOnly.java:36)
at org.gradle.launcher.daemon.server.api.DaemonCommandExecution.proceed(DaemonCommandExecution.java:120)
at org.gradle.launcher.daemon.server.exec.EstablishBuildEnvironment.doBuild(EstablishBuildEnvironment.java:72)
at org.gradle.launcher.daemon.server.exec.BuildCommandOnly.execute(BuildCommandOnly.java:36)
at org.gradle.launcher.daemon.server.api.DaemonCommandExecution.proceed(DaemonCommandExecution.java:120)
at org.gradle.launcher.daemon.server.exec.StartBuildOrRespondWithBusy$1.run(StartBuildOrRespondWithBusy.java:50)
at org.gradle.launcher.daemon.server.DaemonStateCoordinator$1.run(DaemonStateCoordinator.java:297)
at org.gradle.internal.concurrent.ExecutorPolicy$CatchAndRecordFailures.onExecute(ExecutorPolicy.java:63)
at org.gradle.internal.concurrent.StoppableExecutorImpl$1.run(StoppableExecutorImpl.java:46)
Caused by: org.gradle.api.ProjectConfigurationException: A problem occurred configuring root project ‘Basic Java Project’.
at org.gradle.configuration.project.LifecycleProjectEvaluator.addConfigurationFailure(LifecycleProjectEvaluator.java:94)
at org.gradle.configuration.project.LifecycleProjectEvaluator.notifyAfterEvaluate(LifecycleProjectEvaluator.java:89)
at org.gradle.configuration.project.LifecycleProjectEvaluator.doConfigure(LifecycleProjectEvaluator.java:76)
at org.gradle.configuration.project.LifecycleProjectEvaluator.access$000(LifecycleProjectEvaluator.java:33)
at org.gradle.configuration.project.LifecycleProjectEvaluator$1.execute(LifecycleProjectEvaluator.java:53)
at org.gradle.configuration.project.LifecycleProjectEvaluator$1.execute(LifecycleProjectEvaluator.java:50)
at org.gradle.internal.Transformers$4.transform(Transformers.java:169)
at org.gradle.internal.progress.DefaultBuildOperationExecutor.run(DefaultBuildOperationExecutor.java:106)
at org.gradle.internal.progress.DefaultBuildOperationExecutor.run(DefaultBuildOperationExecutor.java:61)
at org.gradle.configuration.project.LifecycleProjectEvaluator.evaluate(LifecycleProjectEvaluator.java:50)
at org.gradle.api.internal.project.DefaultProject.evaluate(DefaultProject.java:648)
at org.gradle.api.internal.project.DefaultProject.evaluate(DefaultProject.java:126)
at org.gradle.execution.TaskPathProjectEvaluator.configure(TaskPathProjectEvaluator.java:35)
at org.gradle.execution.TaskPathProjectEvaluator.configureHierarchy(TaskPathProjectEvaluator.java:60)
at org.gradle.configuration.DefaultBuildConfigurer.configure(DefaultBuildConfigurer.java:38)
at org.gradle.initialization.DefaultGradleLauncher$ConfigureBuildAction.execute(DefaultGradleLauncher.java:207)
at org.gradle.initialization.DefaultGradleLauncher$ConfigureBuildAction.execute(DefaultGradleLauncher.java:204)
at org.gradle.internal.Transformers$4.transform(Transformers.java:169)
at org.gradle.internal.progress.DefaultBuildOperationExecutor.run(DefaultBuildOperationExecutor.java:106)
at org.gradle.internal.progress.DefaultBuildOperationExecutor.run(DefaultBuildOperationExecutor.java:56)
at org.gradle.initialization.DefaultGradleLauncher.doBuildStages(DefaultGradleLauncher.java:146)
at org.gradle.initialization.DefaultGradleLauncher.doBuild(DefaultGradleLauncher.java:112)
… 44 more
Caused by: : java.net.ConnectException: Connection timed out: connect
at org.apache.tools.ant.taskdefs.Get.execute(Get.java:151)
at org.apache.tools.ant.UnknownElement.execute(UnknownElement.java:293)
at org.apache.tools.ant.dispatch.DispatchUtils.execute(DispatchUtils.java:106)
at org.gradle.api.internal.project.ant.BasicAntBuilder.nodeCompleted(BasicAntBuilder.java:78)
at org.gradle.api.internal.project.ant.BasicAntBuilder.doInvokeMethod(BasicAntBuilder.java:103)
at com.esri.arcgisruntime.ArcGISPlugin$_apply_closure1.doCall(ArcGISPlugin.groovy:89)
at org.gradle.listener.ClosureBackedMethodInvocationDispatch.dispatch(ClosureBackedMethodInvocationDispatch.java:40)
at org.gradle.listener.ClosureBackedMethodInvocationDispatch.dispatch(ClosureBackedMethodInvocationDispatch.java:25)
at org.gradle.internal.event.AbstractBroadcastDispatch.dispatch(AbstractBroadcastDispatch.java:42)
at org.gradle.internal.event.BroadcastDispatch$SingletonDispatch.dispatch(BroadcastDispatch.java:221)
at org.gradle.internal.event.BroadcastDispatch$SingletonDispatch.dispatch(BroadcastDispatch.java:145)
at org.gradle.internal.event.AbstractBroadcastDispatch.dispatch(AbstractBroadcastDispatch.java:58)
at org.gradle.internal.event.BroadcastDispatch$CompositeDispatch.dispatch(BroadcastDispatch.java:315)
at org.gradle.internal.event.BroadcastDispatch$CompositeDispatch.dispatch(BroadcastDispatch.java:225)
at org.gradle.internal.event.ListenerBroadcast.dispatch(ListenerBroadcast.java:138)
at org.gradle.internal.event.ListenerBroadcast.dispatch(ListenerBroadcast.java:35)
at org.gradle.internal.dispatch.ProxyDispatchAdapter$DispatchingInvocationHandler.invoke(ProxyDispatchAdapter.java:93)
at com.sun.proxy.$Proxy21.afterEvaluate(Unknown Source)
at org.gradle.configuration.project.LifecycleProjectEvaluator.notifyAfterEvaluate(LifecycleProjectEvaluator.java:82)
… 64 more
Caused by: java.net.ConnectException: Connection timed out: connect
at org.apache.tools.ant.taskdefs.Get$GetThread.openConnection(Get.java:728)
at org.apache.tools.ant.taskdefs.Get$GetThread.get(Get.java:641)
at org.apache.tools.ant.taskdefs.Get$GetThread.run(Get.java:631)


(René Groeschke) #2

Hey.
It looks like you have some connectivity issues in your environment. To narrow down the root cause of that failure can you try to run your build from the command line and not from eclipse/buildship? please just try to run gradle clean build or ./gradlew clean build if you’re using the wrapper and provide the stacktrace.

alternatively you can try to run your build with build scans activated and point us to the created build scan for digging into the problem.

cheers,
René


(Bruce B) #3

c:\Gradle-4.1\bin>gradle clean build --stacktrace
FAILURE: Build failed with an exception.

  • What went wrong:
    Task ‘clean’ not found in root project ‘bin’.
  • Try:
    Run gradle tasks to get a list of available tasks. Run with --info or --debug op
    tion to get more log output.
  • Exception is:
    org.gradle.execution.TaskSelectionException: Task ‘clean’ not found in root proj
    ect ‘bin’.
    at org.gradle.execution.TaskSelector.getSelection(TaskSelector.java:116)
    at org.gradle.execution.TaskSelector.getSelection(TaskSelector.java:81)
    at org.gradle.execution.commandline.CommandLineTaskParser.parseTasks(Com
    mandLineTaskParser.java:42)
    at org.gradle.execution.TaskNameResolvingBuildConfigurationAction.config
    ure(TaskNameResolvingBuildConfigurationAction.java:44)
    at org.gradle.execution.DefaultBuildConfigurationActionExecuter.configur
    e(DefaultBuildConfigurationActionExecuter.java:48)
    at org.gradle.execution.DefaultBuildConfigurationActionExecuter.access$0
    00(DefaultBuildConfigurationActionExecuter.java:25)
    at org.gradle.execution.DefaultBuildConfigurationActionExecuter$1.procee
    d(DefaultBuildConfigurationActionExecuter.java:54)
    at org.gradle.execution.DefaultTasksBuildExecutionAction.configure(Defau
    ltTasksBuildExecutionAction.java:44)
    at org.gradle.execution.DefaultBuildConfigurationActionExecuter.configur
    e(DefaultBuildConfigurationActionExecuter.java:48)
    at org.gradle.execution.DefaultBuildConfigurationActionExecuter.access$0
    00(DefaultBuildConfigurationActionExecuter.java:25)
    at org.gradle.execution.DefaultBuildConfigurationActionExecuter$1.procee
    d(DefaultBuildConfigurationActionExecuter.java:54)
    at org.gradle.execution.ExcludedTaskFilteringBuildConfigurationAction.co
    nfigure(ExcludedTaskFilteringBuildConfigurationAction.java:47)
    at org.gradle.execution.DefaultBuildConfigurationActionExecuter.configur
    e(DefaultBuildConfigurationActionExecuter.java:48)
    at org.gradle.execution.DefaultBuildConfigurationActionExecuter.select(D
    efaultBuildConfigurationActionExecuter.java:36)
    at org.gradle.initialization.DefaultGradleLauncher$CalculateTaskGraph.ru
    n(DefaultGradleLauncher.java:265)
    at org.gradle.internal.progress.DefaultBuildOperationExecutor$RunnableBu
    ildOperationWorker.execute(DefaultBuildOperationExecutor.java:336)
    at org.gradle.internal.progress.DefaultBuildOperationExecutor$RunnableBu
    ildOperationWorker.execute(DefaultBuildOperationExecutor.java:328)
    at org.gradle.internal.progress.DefaultBuildOperationExecutor.execute(De
    faultBuildOperationExecutor.java:197)
    at org.gradle.internal.progress.DefaultBuildOperationExecutor.run(Defaul
    tBuildOperationExecutor.java:107)
    at org.gradle.initialization.DefaultGradleLauncher.constructTaskGraph(De
    faultGradleLauncher.java:173)
    at org.gradle.initialization.DefaultGradleLauncher.doBuildStages(Default
    GradleLauncher.java:128)
    at org.gradle.initialization.DefaultGradleLauncher.executeTasks(DefaultG
    radleLauncher.java:107)
    at org.gradle.internal.invocation.GradleBuildController$1.call(GradleBui
    ldController.java:78)
    at org.gradle.internal.invocation.GradleBuildController$1.call(GradleBui
    ldController.java:75)
    at org.gradle.internal.work.DefaultWorkerLeaseService.withLocks(DefaultW
    orkerLeaseService.java:152)
    at org.gradle.internal.invocation.GradleBuildController.doBuild(GradleBu
    ildController.java:100)
    at org.gradle.internal.invocation.GradleBuildController.run(GradleBuildC
    ontroller.java:75)
    at org.gradle.tooling.internal.provider.ExecuteBuildActionRunner.run(Exe
    cuteBuildActionRunner.java:28)
    at org.gradle.launcher.exec.ChainingBuildActionRunner.run(ChainingBuildA
    ctionRunner.java:35)
    at org.gradle.tooling.internal.provider.ValidatingBuildActionRunner.run(
    ValidatingBuildActionRunner.java:32)
    at org.gradle.launcher.exec.RunAsBuildOperationBuildActionRunner$1.run(R
    unAsBuildOperationBuildActionRunner.java:43)
    at org.gradle.internal.progress.DefaultBuildOperationExecutor$RunnableBu
    ildOperationWorker.execute(DefaultBuildOperationExecutor.java:336)
    at org.gradle.internal.progress.DefaultBuildOperationExecutor$RunnableBu
    ildOperationWorker.execute(DefaultBuildOperationExecutor.java:328)
    at org.gradle.internal.progress.DefaultBuildOperationExecutor.execute(De
    faultBuildOperationExecutor.java:197)
    at org.gradle.internal.progress.DefaultBuildOperationExecutor.run(Defaul
    tBuildOperationExecutor.java:107)
    at org.gradle.launcher.exec.RunAsBuildOperationBuildActionRunner.run(Run
    AsBuildOperationBuildActionRunner.java:40)
    at org.gradle.tooling.internal.provider.SubscribableBuildActionRunner.ru
    n(SubscribableBuildActionRunner.java:51)
    at org.gradle.launcher.exec.InProcessBuildActionExecuter.execute(InProce
    ssBuildActionExecuter.java:45)
    at org.gradle.launcher.exec.InProcessBuildActionExecuter.execute(InProce
    ssBuildActionExecuter.java:29)
    at org.gradle.launcher.exec.BuildTreeScopeBuildActionExecuter.execute(Bu
    ildTreeScopeBuildActionExecuter.java:39)
    at org.gradle.launcher.exec.BuildTreeScopeBuildActionExecuter.execute(Bu
    ildTreeScopeBuildActionExecuter.java:25)
    at org.gradle.tooling.internal.provider.ContinuousBuildActionExecuter.ex
    ecute(ContinuousBuildActionExecuter.java:71)
    at org.gradle.tooling.internal.provider.ContinuousBuildActionExecuter.ex
    ecute(ContinuousBuildActionExecuter.java:45)
    at org.gradle.tooling.internal.provider.ServicesSetupBuildActionExecuter
    .execute(ServicesSetupBuildActionExecuter.java:51)
    at org.gradle.tooling.internal.provider.ServicesSetupBuildActionExecuter
    .execute(ServicesSetupBuildActionExecuter.java:32)
    at org.gradle.tooling.internal.provider.GradleThreadBuildActionExecuter.
    execute(GradleThreadBuildActionExecuter.java:36)
    at org.gradle.tooling.internal.provider.GradleThreadBuildActionExecuter.
    execute(GradleThreadBuildActionExecuter.java:25)
    at org.gradle.tooling.internal.provider.ParallelismConfigurationBuildAct
    ionExecuter.execute(ParallelismConfigurationBuildActionExecuter.java:43)
    at org.gradle.tooling.internal.provider.ParallelismConfigurationBuildAct
    ionExecuter.execute(ParallelismConfigurationBuildActionExecuter.java:29)
    at org.gradle.tooling.internal.provider.StartParamsValidatingActionExecu
    ter.execute(StartParamsValidatingActionExecuter.java:64)
    at org.gradle.tooling.internal.provider.StartParamsValidatingActionExecu
    ter.execute(StartParamsValidatingActionExecuter.java:29)
    at org.gradle.tooling.internal.provider.SessionFailureReportingActionExe
    cuter.execute(SessionFailureReportingActionExecuter.java:55)
    at org.gradle.tooling.internal.provider.SessionFailureReportingActionExe
    cuter.execute(SessionFailureReportingActionExecuter.java:42)
    at org.gradle.tooling.internal.provider.SetupLoggingActionExecuter.execu
    te(SetupLoggingActionExecuter.java:58)
    at org.gradle.tooling.internal.provider.SetupLoggingActionExecuter.execu
    te(SetupLoggingActionExecuter.java:33)
    at org.gradle.launcher.daemon.server.exec.ExecuteBuild.doBuild(ExecuteBu
    ild.java:67)
    at org.gradle.launcher.daemon.server.exec.BuildCommandOnly.execute(Build
    CommandOnly.java:36)
    at org.gradle.launcher.daemon.server.api.DaemonCommandExecution.proceed(
    DaemonCommandExecution.java:120)
    at org.gradle.launcher.daemon.server.exec.WatchForDisconnection.execute(
    WatchForDisconnection.java:37)
    at org.gradle.launcher.daemon.server.api.DaemonCommandExecution.proceed(
    DaemonCommandExecution.java:120)
    at org.gradle.launcher.daemon.server.exec.ResetDeprecationLogger.execute
    (ResetDeprecationLogger.java:26)
    at org.gradle.launcher.daemon.server.api.DaemonCommandExecution.proceed(
    DaemonCommandExecution.java:120)
    at org.gradle.launcher.daemon.server.exec.RequestStopIfSingleUsedDaemon.
    execute(RequestStopIfSingleUsedDaemon.java:34)
    at org.gradle.launcher.daemon.server.api.DaemonCommandExecution.proceed(
    DaemonCommandExecution.java:120)
    at org.gradle.launcher.daemon.server.exec.ForwardClientInput$2.call(Forw
    ardClientInput.java:74)
    at org.gradle.launcher.daemon.server.exec.ForwardClientInput$2.call(Forw
    ardClientInput.java:72)
    at org.gradle.util.Swapper.swap(Swapper.java:38)
    at org.gradle.launcher.daemon.server.exec.ForwardClientInput.execute(For
    wardClientInput.java:72)
    at org.gradle.launcher.daemon.server.api.DaemonCommandExecution.proceed(
    DaemonCommandExecution.java:120)
    at org.gradle.launcher.daemon.server.exec.LogAndCheckHealth.execute(LogA
    ndCheckHealth.java:55)
    at org.gradle.launcher.daemon.server.api.DaemonCommandExecution.proceed(
    DaemonCommandExecution.java:120)
    at org.gradle.launcher.daemon.server.exec.LogToClient.doBuild(LogToClien
    t.java:62)
    at org.gradle.launcher.daemon.server.exec.BuildCommandOnly.execute(Build
    CommandOnly.java:36)
    at org.gradle.launcher.daemon.server.api.DaemonCommandExecution.proceed(
    DaemonCommandExecution.java:120)
    at org.gradle.launcher.daemon.server.exec.EstablishBuildEnvironment.doBu
    ild(EstablishBuildEnvironment.java:82)
    at org.gradle.launcher.daemon.server.exec.BuildCommandOnly.execute(Build
    CommandOnly.java:36)
    at org.gradle.launcher.daemon.server.api.DaemonCommandExecution.proceed(
    DaemonCommandExecution.java:120)
    at org.gradle.launcher.daemon.server.exec.StartBuildOrRespondWithBusy$1.
    run(StartBuildOrRespondWithBusy.java:50)
    at org.gradle.launcher.daemon.server.DaemonStateCoordinator$1.run(Daemon
    StateCoordinator.java:297)
    at org.gradle.internal.concurrent.ExecutorPolicy$CatchAndRecordFailures.
    onExecute(ExecutorPolicy.java:63)
    at org.gradle.internal.concurrent.ManagedExecutorImpl$1.run(ManagedExecu
    torImpl.java:46)
    at org.gradle.internal.concurrent.ThreadFactoryImpl$ManagedThreadRunnabl
    e.run(ThreadFactoryImpl.java:55)
  • Get more help at https://help.gradle.org
    BUILD FAILED in 1s