Running project using gradle

Main error: A failure occurred while executing org.jetbrains.kotlin.compilerRunner.GradleCompilerRunnerWithWorkers$GradleKotlinCompilerWorkAction

19:49:59: Executing ':run'...

Configuration on demand is an incubating feature.
> Task :processResources UP-TO-DATE
Download https://repo.maven.apache.org/maven2/org/jetbrains/kotlin/kotlin-reflect/1.6.10/kotlin-reflect-1.6.10.pom, took 20 ms (1.38 kB)
Download https://repo.maven.apache.org/maven2/org/jetbrains/kotlin/kotlin-reflect/1.6.10/kotlin-reflect-1.6.10.jar, took 252 ms (3.04 MB)
> Task :db-migrator:processResources NO-SOURCE

> Task :db-migrator:compileKotlin FAILED
2 actionable tasks: 1 executed, 1 up-to-date
e: file:///C:/Panav/Projects/ls-bot/db-migrator/src/main/kotlin/com/learnspigot/bot/dbmigrator/http/HttpService.kt:9:17 Unresolved reference: http
e: file:///C:/Panav/Projects/ls-bot/db-migrator/src/main/kotlin/com/learnspigot/bot/dbmigrator/http/HttpService.kt:10:17 Unresolved reference: http
e: file:///C:/Panav/Projects/ls-bot/db-migrator/src/main/kotlin/com/learnspigot/bot/dbmigrator/http/HttpService.kt:11:17 Unresolved reference: http
e: file:///C:/Panav/Projects/ls-bot/db-migrator/src/main/kotlin/com/learnspigot/bot/dbmigrator/http/HttpService.kt:12:17 Unresolved reference: http
e: file:///C:/Panav/Projects/ls-bot/db-migrator/src/main/kotlin/com/learnspigot/bot/dbmigrator/http/HttpService.kt:17:25 Unresolved reference: HttpClient
e: file:///C:/Panav/Projects/ls-bot/db-migrator/src/main/kotlin/com/learnspigot/bot/dbmigrator/http/HttpService.kt:17:38 Unresolved reference: HttpClient
e: file:///C:/Panav/Projects/ls-bot/db-migrator/src/main/kotlin/com/learnspigot/bot/dbmigrator/http/HttpService.kt:19:34 Unresolved reference: HttpRequest
e: file:///C:/Panav/Projects/ls-bot/db-migrator/src/main/kotlin/com/learnspigot/bot/dbmigrator/http/HttpService.kt:19:49 Unresolved reference: HttpResponse
e: file:///C:/Panav/Projects/ls-bot/db-migrator/src/main/kotlin/com/learnspigot/bot/dbmigrator/http/HttpService.kt:23:36 Unresolved reference: HttpRequest
e: file:///C:/Panav/Projects/ls-bot/db-migrator/src/main/kotlin/com/learnspigot/bot/dbmigrator/http/HttpService.kt:23:51 Unresolved reference: HttpResponse
e: file:///C:/Panav/Projects/ls-bot/db-migrator/src/main/kotlin/com/learnspigot/bot/dbmigrator/http/HttpService.kt:24:23 Unresolved reference: HttpResponse
e: file:///C:/Panav/Projects/ls-bot/db-migrator/src/main/kotlin/com/learnspigot/bot/dbmigrator/http/HttpService.kt:25:34 Unresolved reference: HttpResponse
e: file:///C:/Panav/Projects/ls-bot/db-migrator/src/main/kotlin/com/learnspigot/bot/dbmigrator/http/HttpService.kt:34:41 Unresolved reference: HttpResponse
e: file:///C:/Panav/Projects/ls-bot/db-migrator/src/main/kotlin/com/learnspigot/bot/dbmigrator/http/HttpService.kt:34:64 Unresolved reference: HttpResponse
e: file:///C:/Panav/Projects/ls-bot/db-migrator/src/main/kotlin/com/learnspigot/bot/dbmigrator/http/HttpService.kt:35:25 Unresolved reference: HttpResponse
e: file:///C:/Panav/Projects/ls-bot/db-migrator/src/main/kotlin/com/learnspigot/bot/dbmigrator/http/HttpService.kt:36:13 'statusCode' overrides nothing
e: file:///C:/Panav/Projects/ls-bot/db-migrator/src/main/kotlin/com/learnspigot/bot/dbmigrator/http/HttpService.kt:40:13 'request' overrides nothing
e: file:///C:/Panav/Projects/ls-bot/db-migrator/src/main/kotlin/com/learnspigot/bot/dbmigrator/http/HttpService.kt:40:37 Unresolved reference: HttpRequest
e: file:///C:/Panav/Projects/ls-bot/db-migrator/src/main/kotlin/com/learnspigot/bot/dbmigrator/http/HttpService.kt:44:13 'previousResponse' overrides nothing
e: file:///C:/Panav/Projects/ls-bot/db-migrator/src/main/kotlin/com/learnspigot/bot/dbmigrator/http/HttpService.kt:44:55 Unresolved reference: HttpResponse
e: file:///C:/Panav/Projects/ls-bot/db-migrator/src/main/kotlin/com/learnspigot/bot/dbmigrator/http/HttpService.kt:52:13 'headers' overrides nothing
e: file:///C:/Panav/Projects/ls-bot/db-migrator/src/main/kotlin/com/learnspigot/bot/dbmigrator/http/HttpService.kt:52:37 Unresolved reference: HttpHeaders
e: file:///C:/Panav/Projects/ls-bot/db-migrator/src/main/kotlin/com/learnspigot/bot/dbmigrator/http/HttpService.kt:56:13 'body' overrides nothing
e: file:///C:/Panav/Projects/ls-bot/db-migrator/src/main/kotlin/com/learnspigot/bot/dbmigrator/http/HttpService.kt:60:13 'sslSession' overrides nothing
e: file:///C:/Panav/Projects/ls-bot/db-migrator/src/main/kotlin/com/learnspigot/bot/dbmigrator/http/HttpService.kt:64:13 'uri' overrides nothing
e: file:///C:/Panav/Projects/ls-bot/db-migrator/src/main/kotlin/com/learnspigot/bot/dbmigrator/http/HttpService.kt:68:13 'version' overrides nothing
e: file:///C:/Panav/Projects/ls-bot/db-migrator/src/main/kotlin/com/learnspigot/bot/dbmigrator/http/HttpService.kt:68:37 Unresolved reference: HttpClient
e: file:///C:/Panav/Projects/ls-bot/db-migrator/src/main/kotlin/com/learnspigot/bot/dbmigrator/http/HttpService.kt:74:41 Unresolved reference: HttpRequest
e: file:///C:/Panav/Projects/ls-bot/db-migrator/src/main/kotlin/com/learnspigot/bot/dbmigrator/http/HttpService.kt:76:13 Unresolved reference: HttpRequest
e: file:///C:/Panav/Projects/ls-bot/db-migrator/src/main/kotlin/com/learnspigot/bot/dbmigrator/http/UdemyService.kt:5:17 Unresolved reference: http
e: file:///C:/Panav/Projects/ls-bot/db-migrator/src/main/kotlin/com/learnspigot/bot/dbmigrator/http/UdemyService.kt:16:9 Not enough information to infer type variable R
e: file:///C:/Panav/Projects/ls-bot/db-migrator/src/main/kotlin/com/learnspigot/bot/dbmigrator/http/UdemyService.kt:22:45 Unresolved reference: HttpRequest
e: file:///C:/Panav/Projects/ls-bot/db-migrator/src/main/kotlin/com/learnspigot/bot/dbmigrator/http/UdemyService.kt:24:13 Unresolved reference: HttpRequest

FAILURE: Build failed with an exception.

* What went wrong:
Execution failed for task ':db-migrator:compileKotlin'.
> A failure occurred while executing org.jetbrains.kotlin.compilerRunner.GradleCompilerRunnerWithWorkers$GradleKotlinCompilerWorkAction
   > Compilation error. See log for more details

* Try:
> Run with --stacktrace option to get the stack trace.
> Run with --info or --debug option to get more log output.
> Run with --scan to get full insights.

* Get more help at https://help.gradle.org

BUILD FAILED in 11s
19:50:12: Execution finished ':run'.

For some reasons I am facing issues running a project, the same project with same gradle configuration can be run by other friends of mine. Does anyone have any insight about this? I can provide any code if needed

I’d guess the project needs at least Java 11 as it uses its new HTTP client,
but does not use JVM toolchains which would make the needs of the production code independent of the Java version you use to run Gradle.
So you need to run Gradle with at least Java 11 and suggest the project to use JVM toolchains in their build.

I am using Java 17 for the project, which is why I am confused as to why this might be an issue

What does running Gradle with --version output?


Gradle 7.6

Build time: 2022-11-25 13:35:10 UTC
Revision: daece9dbc5b79370cc8e4fd6fe4b2cd400e150a8

Kotlin: 1.7.10
Groovy: 3.0.13
Ant: Apache Ant™ version 1.10.11 compiled on July 10 2021
JVM: 1.8.0_352 (Azul Systems, Inc. 25.352-b08)
OS: Windows 10 10.0 amd64

Simply this when I run gradle --version

You see, you use Java 8 to run Gradle, so what I said before. :wink:

Build file ‘C:\Panav\Projects\ls-bot\build.gradle.kts’ line: 1

Plugin [id: ‘org.jetbrains.kotlin.jvm’, version: ‘17’] was not found in any of the following sources:

  • Try:

Run with --info or --debug option to get more log output.
Run with --scan to get full insights.

  • Exception is:
    org.gradle.api.plugins.UnknownPluginException: Plugin [id: ‘org.jetbrains.kotlin.jvm’, version: ‘17’] was not found in any of the following sources:
  • Gradle Core Plugins (plugin is not in ‘org.gradle’ namespace)
  • Plugin Repositories (could not resolve plugin artifact ‘org.jetbrains.kotlin.jvm:org.jetbrains.kotlin.jvm.gradle.plugin:17’)
    Searched in the following repositories:
    Gradle Central Plugin Repository
    at org.gradle.plugin.use.internal.DefaultPluginRequestApplicator.resolveToFoundResult(DefaultPluginRequestApplicator.java:238)
    at org.gradle.plugin.use.internal.DefaultPluginRequestApplicator.lambda$resolvePluginRequests$3(DefaultPluginRequestApplicator.java:168)
    at org.gradle.util.internal.CollectionUtils.collect(CollectionUtils.java:212)
    at org.gradle.util.internal.CollectionUtils.collect(CollectionUtils.java:206)
    at org.gradle.plugin.use.internal.DefaultPluginRequestApplicator.resolvePluginRequests(DefaultPluginRequestApplicator.java:166)
    at org.gradle.plugin.use.internal.DefaultPluginRequestApplicator.applyPlugins(DefaultPluginRequestApplicator.java:101)
    at org.gradle.kotlin.dsl.provider.PluginRequestsHandler.handle(PluginRequestsHandler.kt:48)
    at org.gradle.kotlin.dsl.provider.StandardKotlinScriptEvaluator$InterpreterHost.applyPluginsTo(KotlinScriptEvaluator.kt:195)
    at org.gradle.kotlin.dsl.execution.Interpreter$ProgramHost.applyPluginsTo(Interpreter.kt:398)
    at Program.execute(Unknown Source)
    at org.gradle.kotlin.dsl.execution.Interpreter$ProgramHost.eval(Interpreter.kt:532)
    at org.gradle.kotlin.dsl.execution.Interpreter.eval(Interpreter.kt:184)
    at org.gradle.kotlin.dsl.provider.StandardKotlinScriptEvaluator.evaluate(KotlinScriptEvaluator.kt:115)
    at org.gradle.kotlin.dsl.provider.KotlinScriptPluginFactory$create$1.invoke(KotlinScriptPluginFactory.kt:51)
    at org.gradle.kotlin.dsl.provider.KotlinScriptPluginFactory$create$1.invoke(KotlinScriptPluginFactory.kt:36)
    at org.gradle.kotlin.dsl.provider.KotlinScriptPlugin.apply(KotlinScriptPlugin.kt:34)
    at org.gradle.configuration.BuildOperationScriptPlugin$1.run(BuildOperationScriptPlugin.java:65)
    at org.gradle.internal.operations.DefaultBuildOperationRunner$1.execute(DefaultBuildOperationRunner.java:29)
    at org.gradle.internal.operations.DefaultBuildOperationRunner$1.execute(DefaultBuildOperationRunner.java:26)
    at org.gradle.internal.operations.DefaultBuildOperationRunner$2.execute(DefaultBuildOperationRunner.java:66)
    at org.gradle.internal.operations.DefaultBuildOperationRunner$2.execute(DefaultBuildOperationRunner.java:59)
    at org.gradle.internal.operations.DefaultBuildOperationRunner.execute(DefaultBuildOperationRunner.java:157)
    at org.gradle.internal.operations.DefaultBuildOperationRunner.execute(DefaultBuildOperationRunner.java:59)
    at org.gradle.internal.operations.DefaultBuildOperationRunner.run(DefaultBuildOperationRunner.java:47)
    at org.gradle.internal.operations.DefaultBuildOperationExecutor.run(DefaultBuildOperationExecutor.java:68)
    at org.gradle.configuration.BuildOperationScriptPlugin.lambda$apply$0(BuildOperationScriptPlugin.java:62)
    at org.gradle.configuration.internal.DefaultUserCodeApplicationContext.apply(DefaultUserCodeApplicationContext.java:44)
    at org.gradle.configuration.BuildOperationScriptPlugin.apply(BuildOperationScriptPlugin.java:62)
    at org.gradle.api.internal.project.DefaultProjectStateRegistry$ProjectStateImpl.lambda$applyToMutableState$0(DefaultProjectStateRegistry.java:360)
    at org.gradle.api.internal.project.DefaultProjectStateRegistry$ProjectStateImpl.fromMutableState(DefaultProjectStateRegistry.java:378)
    at org.gradle.api.internal.project.DefaultProjectStateRegistry$ProjectStateImpl.applyToMutableState(DefaultProjectStateRegistry.java:359)
    at org.gradle.configuration.project.BuildScriptProcessor.execute(BuildScriptProcessor.java:42)
    at org.gradle.configuration.project.BuildScriptProcessor.execute(BuildScriptProcessor.java:26)
    at org.gradle.configuration.project.ConfigureActionsProjectEvaluator.evaluate(ConfigureActionsProjectEvaluator.java:35)
    at org.gradle.configuration.project.LifecycleProjectEvaluator$EvaluateProject.lambda$run$0(LifecycleProjectEvaluator.java:109)
    at org.gradle.api.internal.project.DefaultProjectStateRegistry$ProjectStateImpl.lambda$applyToMutableState$0(DefaultProjectStateRegistry.java:360)
    at org.gradle.api.internal.project.DefaultProjectStateRegistry$ProjectStateImpl.lambda$fromMutableState$1(DefaultProjectStateRegistry.java:383)
    at org.gradle.internal.work.DefaultWorkerLeaseService.withReplacedLocks(DefaultWorkerLeaseService.java:345)
    at org.gradle.api.internal.project.DefaultProjectStateRegistry$ProjectStateImpl.fromMutableState(DefaultProjectStateRegistry.java:383)
    at org.gradle.api.internal.project.DefaultProjectStateRegistry$ProjectStateImpl.applyToMutableState(DefaultProjectStateRegistry.java:359)
    at org.gradle.configuration.project.LifecycleProjectEvaluator$EvaluateProject.run(LifecycleProjectEvaluator.java:100)
    at org.gradle.internal.operations.DefaultBuildOperationRunner$1.execute(DefaultBuildOperationRunner.java:29)
    at org.gradle.internal.operations.DefaultBuildOperationRunner$1.execute(DefaultBuildOperationRunner.java:26)
    at org.gradle.internal.operations.DefaultBuildOperationRunner$2.execute(DefaultBuildOperationRunner.java:66)
    at org.gradle.internal.operations.DefaultBuildOperationRunner$2.execute(DefaultBuildOperationRunner.java:59)
    at org.gradle.internal.operations.DefaultBuildOperationRunner.execute(DefaultBuildOperationRunner.java:157)
    at org.gradle.internal.operations.DefaultBuildOperationRunner.execute(DefaultBuildOperationRunner.java:59)
    at org.gradle.internal.operations.DefaultBuildOperationRunner.run(DefaultBuildOperationRunner.java:47)
    at org.gradle.internal.operations.DefaultBuildOperationExecutor.run(DefaultBuildOperationExecutor.java:68)
    at org.gradle.configuration.project.LifecycleProjectEvaluator.evaluate(LifecycleProjectEvaluator.java:72)
    at org.gradle.api.internal.project.DefaultProject.evaluate(DefaultProject.java:762)
    at org.gradle.api.internal.project.DefaultProject.evaluate(DefaultProject.java:153)
    at org.gradle.api.internal.project.ProjectLifecycleController.lambda$ensureSelfConfigured$1(ProjectLifecycleController.java:63)
    at org.gradle.internal.model.StateTransitionController.lambda$doTransition$12(StateTransitionController.java:236)
    at org.gradle.internal.model.StateTransitionController.doTransition(StateTransitionController.java:247)
    at org.gradle.internal.model.StateTransitionController.doTransition(StateTransitionController.java:235)
    at org.gradle.internal.model.StateTransitionController.lambda$maybeTransitionIfNotCurrentlyTransitioning$9(StateTransitionController.java:196)
    at org.gradle.internal.work.DefaultSynchronizer.withLock(DefaultSynchronizer.java:34)
    at org.gradle.internal.model.StateTransitionController.maybeTransitionIfNotCurrentlyTransitioning(StateTransitionController.java:192)
    at org.gradle.api.internal.project.ProjectLifecycleController.ensureSelfConfigured(ProjectLifecycleController.java:63)
    at org.gradle.api.internal.project.DefaultProjectStateRegistry$ProjectStateImpl.ensureConfigured(DefaultProjectStateRegistry.java:334)
    at org.gradle.execution.TaskPathProjectEvaluator.configure(TaskPathProjectEvaluator.java:33)
    at org.gradle.execution.TaskPathProjectEvaluator.configureHierarchy(TaskPathProjectEvaluator.java:47)
    at org.gradle.configuration.DefaultProjectsPreparer.prepareProjects(DefaultProjectsPreparer.java:50)
    at org.gradle.configuration.BuildTreePreparingProjectsPreparer.prepareProjects(BuildTreePreparingProjectsPreparer.java:64)
    at org.gradle.configuration.BuildOperationFiringProjectsPreparer$ConfigureBuild.run(BuildOperationFiringProjectsPreparer.java:52)
    at org.gradle.internal.operations.DefaultBuildOperationRunner$1.execute(DefaultBuildOperationRunner.java:29)
    at org.gradle.internal.operations.DefaultBuildOperationRunner$1.execute(DefaultBuildOperationRunner.java:26)
    at org.gradle.internal.operations.DefaultBuildOperationRunner$2.execute(DefaultBuildOperationRunner.java:66)
    at org.gradle.internal.operations.DefaultBuildOperationRunner$2.execute(DefaultBuildOperationRunner.java:59)
    at org.gradle.internal.operations.DefaultBuildOperationRunner.execute(DefaultBuildOperationRunner.java:157)
    at org.gradle.internal.operations.DefaultBuildOperationRunner.execute(DefaultBuildOperationRunner.java:59)
    at org.gradle.internal.operations.DefaultBuildOperationRunner.run(DefaultBuildOperationRunner.java:47)
    at org.gradle.internal.operations.DefaultBuildOperationExecutor.run(DefaultBuildOperationExecutor.java:68)
    at org.gradle.configuration.BuildOperationFiringProjectsPreparer.prepareProjects(BuildOperationFiringProjectsPreparer.java:40)
    at org.gradle.initialization.VintageBuildModelController.lambda$prepareProjects$2(VintageBuildModelController.java:84)
    at org.gradle.internal.model.StateTransitionController.lambda$doTransition$12(StateTransitionController.java:236)
    at org.gradle.internal.model.StateTransitionController.doTransition(StateTransitionController.java:247)
    at org.gradle.internal.model.StateTransitionController.doTransition(StateTransitionController.java:235)
    at org.gradle.internal.model.StateTransitionController.lambda$transitionIfNotPreviously$10(StateTransitionController.java:210)
    at org.gradle.internal.work.DefaultSynchronizer.withLock(DefaultSynchronizer.java:34)
    at org.gradle.internal.model.StateTransitionController.transitionIfNotPreviously(StateTransitionController.java:206)
    at org.gradle.initialization.VintageBuildModelController.prepareProjects(VintageBuildModelController.java:84)
    at org.gradle.initialization.VintageBuildModelController.getConfiguredModel(VintageBuildModelController.java:64)
    at org.gradle.internal.build.DefaultBuildLifecycleController.lambda$withProjectsConfigured$1(DefaultBuildLifecycleController.java:116)
    at org.gradle.internal.model.StateTransitionController.lambda$notInState$3(StateTransitionController.java:143)
    at org.gradle.internal.work.DefaultSynchronizer.withLock(DefaultSynchronizer.java:44)
    at org.gradle.internal.model.StateTransitionController.notInState(StateTransitionController.java:139)
    at org.gradle.internal.build.DefaultBuildLifecycleController.withProjectsConfigured(DefaultBuildLifecycleController.java:116)
    at org.gradle.internal.build.DefaultBuildToolingModelController.locateBuilderForTarget(DefaultBuildToolingModelController.java:57)
    at org.gradle.internal.buildtree.DefaultBuildTreeModelCreator$DefaultBuildTreeModelController.lambda$locateBuilderForTarget$0(DefaultBuildTreeModelCreator.java:73)
    at org.gradle.internal.build.DefaultBuildLifecycleController.withToolingModels(DefaultBuildLifecycleController.java:180)
    at org.gradle.internal.build.AbstractBuildState.withToolingModels(AbstractBuildState.java:123)
    at org.gradle.internal.buildtree.DefaultBuildTreeModelCreator$DefaultBuildTreeModelController.locateBuilderForTarget(DefaultBuildTreeModelCreator.java:73)
    at org.gradle.internal.buildtree.DefaultBuildTreeModelCreator$DefaultBuildTreeModelController.locateBuilderForDefaultTarget(DefaultBuildTreeModelCreator.java:68)
    at org.gradle.tooling.internal.provider.runner.DefaultBuildController.getTarget(DefaultBuildController.java:157)
    at org.gradle.tooling.internal.provider.runner.DefaultBuildController.getModel(DefaultBuildController.java:101)
    at org.gradle.tooling.internal.consumer.connection.ParameterAwareBuildControllerAdapter.getModel(ParameterAwareBuildControllerAdapter.java:39)
    at org.gradle.tooling.internal.consumer.connection.UnparameterizedBuildController.getModel(UnparameterizedBuildController.java:113)
    at org.gradle.tooling.internal.consumer.connection.NestedActionAwareBuildControllerAdapter.getModel(NestedActionAwareBuildControllerAdapter.java:31)
    at org.gradle.tooling.internal.consumer.connection.UnparameterizedBuildController.findModel(UnparameterizedBuildController.java:97)
    at org.gradle.tooling.internal.consumer.connection.NestedActionAwareBuildControllerAdapter.findModel(NestedActionAwareBuildControllerAdapter.java:31)
    at org.gradle.tooling.internal.consumer.connection.UnparameterizedBuildController.findModel(UnparameterizedBuildController.java:81)
    at org.gradle.tooling.internal.consumer.connection.NestedActionAwareBuildControllerAdapter.findModel(NestedActionAwareBuildControllerAdapter.java:31)
    at org.gradle.tooling.internal.consumer.connection.UnparameterizedBuildController.findModel(UnparameterizedBuildController.java:66)
    at org.gradle.tooling.internal.consumer.connection.NestedActionAwareBuildControllerAdapter.findModel(NestedActionAwareBuildControllerAdapter.java:31)
    at org.jetbrains.plugins.gradle.model.ProjectImportAction.execute(ProjectImportAction.java:130)
    at org.jetbrains.plugins.gradle.model.ProjectImportAction.execute(ProjectImportAction.java:42)
    at org.gradle.tooling.internal.consumer.connection.InternalBuildActionAdapter.execute(InternalBuildActionAdapter.java:64)
    at org.gradle.tooling.internal.provider.runner.AbstractClientProvidedBuildActionRunner$ActionAdapter.runAction(AbstractClientProvidedBuildActionRunner.java:131)
    at org.gradle.tooling.internal.provider.runner.AbstractClientProvidedBuildActionRunner$ActionAdapter.beforeTasks(AbstractClientProvidedBuildActionRunner.java:99)
    at org.gradle.internal.buildtree.DefaultBuildTreeModelCreator.beforeTasks(DefaultBuildTreeModelCreator.java:52)
    at org.gradle.internal.buildtree.DefaultBuildTreeLifecycleController.lambda$fromBuildModel$2(DefaultBuildTreeLifecycleController.java:82)
    at org.gradle.internal.buildtree.DefaultBuildTreeLifecycleController.lambda$runBuild$5(DefaultBuildTreeLifecycleController.java:113)
    at org.gradle.internal.model.StateTransitionController.lambda$transition$5(StateTransitionController.java:166)
    at org.gradle.internal.model.StateTransitionController.doTransition(StateTransitionController.java:247)
    at org.gradle.internal.model.StateTransitionController.lambda$transition$6(StateTransitionController.java:166)
    at org.gradle.internal.work.DefaultSynchronizer.withLock(DefaultSynchronizer.java:44)
    at org.gradle.internal.model.StateTransitionController.transition(StateTransitionController.java:166)
    at org.gradle.internal.buildtree.DefaultBuildTreeLifecycleController.runBuild(DefaultBuildTreeLifecycleController.java:110)
    at org.gradle.internal.buildtree.DefaultBuildTreeLifecycleController.fromBuildModel(DefaultBuildTreeLifecycleController.java:81)
    at org.gradle.tooling.internal.provider.runner.AbstractClientProvidedBuildActionRunner.runClientAction(AbstractClientProvidedBuildActionRunner.java:43)
    at org.gradle.tooling.internal.provider.runner.ClientProvidedPhasedActionRunner.run(ClientProvidedPhasedActionRunner.java:53)
    at org.gradle.launcher.exec.ChainingBuildActionRunner.run(ChainingBuildActionRunner.java:35)
    at org.gradle.internal.buildtree.ProblemReportingBuildActionRunner.run(ProblemReportingBuildActionRunner.java:49)
    at org.gradle.launcher.exec.BuildOutcomeReportingBuildActionRunner.run(BuildOutcomeReportingBuildActionRunner.java:65)
    at org.gradle.tooling.internal.provider.FileSystemWatchingBuildActionRunner.run(FileSystemWatchingBuildActionRunner.java:136)
    at org.gradle.launcher.exec.BuildCompletionNotifyingBuildActionRunner.run(BuildCompletionNotifyingBuildActionRunner.java:41)
    at org.gradle.launcher.exec.RootBuildLifecycleBuildActionExecutor.lambda$execute$0(RootBuildLifecycleBuildActionExecutor.java:40)
    at org.gradle.composite.internal.DefaultRootBuildState.run(DefaultRootBuildState.java:122)
    at org.gradle.launcher.exec.RootBuildLifecycleBuildActionExecutor.execute(RootBuildLifecycleBuildActionExecutor.java:40)
    at org.gradle.internal.buildtree.DefaultBuildTreeContext.execute(DefaultBuildTreeContext.java:40)
    at org.gradle.launcher.exec.BuildTreeLifecycleBuildActionExecutor.lambda$execute$0(BuildTreeLifecycleBuildActionExecutor.java:65)
    at org.gradle.internal.buildtree.BuildTreeState.run(BuildTreeState.java:53)
    at org.gradle.launcher.exec.BuildTreeLifecycleBuildActionExecutor.execute(BuildTreeLifecycleBuildActionExecutor.java:65)
    at org.gradle.launcher.exec.RunAsBuildOperationBuildActionExecutor$3.call(RunAsBuildOperationBuildActionExecutor.java:61)
    at org.gradle.launcher.exec.RunAsBuildOperationBuildActionExecutor$3.call(RunAsBuildOperationBuildActionExecutor.java:57)
    at org.gradle.internal.operations.DefaultBuildOperationRunner$CallableBuildOperationWorker.execute(DefaultBuildOperationRunner.java:204)
    at org.gradle.internal.operations.DefaultBuildOperationRunner$CallableBuildOperationWorker.execute(DefaultBuildOperationRunner.java:199)
    at org.gradle.internal.operations.DefaultBuildOperationRunner$2.execute(DefaultBuildOperationRunner.java:66)
    at org.gradle.internal.operations.DefaultBuildOperationRunner$2.execute(DefaultBuildOperationRunner.java:59)
    at org.gradle.internal.operations.DefaultBuildOperationRunner.execute(DefaultBuildOperationRunner.java:157)
    at org.gradle.internal.operations.DefaultBuildOperationRunner.execute(DefaultBuildOperationRunner.java:59)
    at org.gradle.internal.operations.DefaultBuildOperationRunner.call(DefaultBuildOperationRunner.java:53)
    at org.gradle.internal.operations.DefaultBuildOperationExecutor.call(DefaultBuildOperationExecutor.java:73)
    at org.gradle.launcher.exec.RunAsBuildOperationBuildActionExecutor.execute(RunAsBuildOperationBuildActionExecutor.java:57)
    at org.gradle.launcher.exec.RunAsWorkerThreadBuildActionExecutor.lambda$execute$0(RunAsWorkerThreadBuildActionExecutor.java:36)
    at org.gradle.internal.work.DefaultWorkerLeaseService.withLocks(DefaultWorkerLeaseService.java:249)
    at org.gradle.internal.work.DefaultWorkerLeaseService.runAsWorkerThread(DefaultWorkerLeaseService.java:109)
    at org.gradle.launcher.exec.RunAsWorkerThreadBuildActionExecutor.execute(RunAsWorkerThreadBuildActionExecutor.java:36)
    at org.gradle.tooling.internal.provider.continuous.ContinuousBuildActionExecutor.execute(ContinuousBuildActionExecutor.java:110)
    at org.gradle.tooling.internal.provider.SubscribableBuildActionExecutor.execute(SubscribableBuildActionExecutor.java:64)
    at org.gradle.internal.session.DefaultBuildSessionContext.execute(DefaultBuildSessionContext.java:46)
    at org.gradle.tooling.internal.provider.BuildSessionLifecycleBuildActionExecuter$ActionImpl.apply(BuildSessionLifecycleBuildActionExecuter.java:100)
    at org.gradle.tooling.internal.provider.BuildSessionLifecycleBuildActionExecuter$ActionImpl.apply(BuildSessionLifecycleBuildActionExecuter.java:88)
    at org.gradle.internal.session.BuildSessionState.run(BuildSessionState.java:69)
    at org.gradle.tooling.internal.provider.BuildSessionLifecycleBuildActionExecuter.execute(BuildSessionLifecycleBuildActionExecuter.java:62)
    at org.gradle.tooling.internal.provider.BuildSessionLifecycleBuildActionExecuter.execute(BuildSessionLifecycleBuildActionExecuter.java:41)
    at org.gradle.tooling.internal.provider.StartParamsValidatingActionExecuter.execute(StartParamsValidatingActionExecuter.java:63)
    at org.gradle.tooling.internal.provider.StartParamsValidatingActionExecuter.execute(StartParamsValidatingActionExecuter.java:31)
    at org.gradle.tooling.internal.provider.SessionFailureReportingActionExecuter.execute(SessionFailureReportingActionExecuter.java:52)
    at org.gradle.tooling.internal.provider.SessionFailureReportingActionExecuter.execute(SessionFailureReportingActionExecuter.java:40)
    at org.gradle.tooling.internal.provider.SetupLoggingActionExecuter.execute(SetupLoggingActionExecuter.java:47)
    at org.gradle.tooling.internal.provider.SetupLoggingActionExecuter.execute(SetupLoggingActionExecuter.java:31)
    at org.gradle.launcher.daemon.server.exec.ExecuteBuild.doBuild(ExecuteBuild.java:65)
    at org.gradle.launcher.daemon.server.exec.BuildCommandOnly.execute(BuildCommandOnly.java:37)
    at org.gradle.launcher.daemon.server.api.DaemonCommandExecution.proceed(DaemonCommandExecution.java:104)
    at org.gradle.launcher.daemon.server.exec.WatchForDisconnection.execute(WatchForDisconnection.java:39)
    at org.gradle.launcher.daemon.server.api.DaemonCommandExecution.proceed(DaemonCommandExecution.java:104)
    at org.gradle.launcher.daemon.server.exec.ResetDeprecationLogger.execute(ResetDeprecationLogger.java:29)
    at org.gradle.launcher.daemon.server.api.DaemonCommandExecution.proceed(DaemonCommandExecution.java:104)
    at org.gradle.launcher.daemon.server.exec.RequestStopIfSingleUsedDaemon.execute(RequestStopIfSingleUsedDaemon.java:35)
    at org.gradle.launcher.daemon.server.api.DaemonCommandExecution.proceed(DaemonCommandExecution.java:104)
    at org.gradle.launcher.daemon.server.exec.ForwardClientInput$2.create(ForwardClientInput.java:78)
    at org.gradle.launcher.daemon.server.exec.ForwardClientInput$2.create(ForwardClientInput.java:75)
    at org.gradle.util.internal.Swapper.swap(Swapper.java:38)
    at org.gradle.launcher.daemon.server.exec.ForwardClientInput.execute(ForwardClientInput.java:75)
    at org.gradle.launcher.daemon.server.api.DaemonCommandExecution.proceed(DaemonCommandExecution.java:104)
    at org.gradle.launcher.daemon.server.exec.LogAndCheckHealth.execute(LogAndCheckHealth.java:55)
    at org.gradle.launcher.daemon.server.api.DaemonCommandExecution.proceed(DaemonCommandExecution.java:104)
    at org.gradle.launcher.daemon.server.exec.LogToClient.doBuild(LogToClient.java:63)
    at org.gradle.launcher.daemon.server.exec.BuildCommandOnly.execute(BuildCommandOnly.java:37)
    at org.gradle.launcher.daemon.server.api.DaemonCommandExecution.proceed(DaemonCommandExecution.java:104)
    at org.gradle.launcher.daemon.server.exec.EstablishBuildEnvironment.doBuild(EstablishBuildEnvironment.java:84)
    at org.gradle.launcher.daemon.server.exec.BuildCommandOnly.execute(BuildCommandOnly.java:37)
    at org.gradle.launcher.daemon.server.api.DaemonCommandExecution.proceed(DaemonCommandExecution.java:104)
    at org.gradle.launcher.daemon.server.exec.StartBuildOrRespondWithBusy$1.run(StartBuildOrRespondWithBusy.java:52)
    at org.gradle.launcher.daemon.server.DaemonStateCoordinator$1.run(DaemonStateCoordinator.java:297)
    at org.gradle.internal.concurrent.ExecutorPolicy$CatchAndRecordFailures.onExecute(ExecutorPolicy.java:64)
    at org.gradle.internal.concurrent.ManagedExecutorImpl$1.run(ManagedExecutorImpl.java:49)

this is the error that pops when I change the jvm version in settings.gradle.kts to 17. I changed
image
this one jvm option in built.gradle.kts to 17, yet the issue persists?