Issue while running a gradle project in eclipse


(Gopinath Savekar) #1

When I try to convert an existing Eclipse project to Gradle (via Configure -> Add Gradle nature), I get below errors:

I’m running gradle version 3.2.1. I’ve running the project on Eclipse Neon.

Is there a step I’m missing?

Error 1:

Compilation failed; see the compiler error output for details. Could not fetch model of type ‘EclipseProject’ using Gradle distribution ‘https://services.gradle.org/distributions/gradle-3.2.1-bin.zip’.

Error 2:

org.gradle.tooling.BuildException: Could not fetch model of type ‘EclipseProject’ using Gradle distribution ‘https://services.gradle.org/distributions/gradle-3.2.1-bin.zip’. at org.gradle.tooling.internal.consumer.ExceptionTransformer.transform(ExceptionTransformer.java:51) at org.gradle.tooling.internal.consumer.ExceptionTransformer.transform(ExceptionTransformer.java:29) at org.gradle.tooling.internal.consumer.ResultHandlerAdapter.onFailure(ResultHandlerAdapter.java:41) at org.gradle.tooling.internal.consumer.async.DefaultAsyncConsumerActionExecutor$1$1.run(DefaultAsyncConsumerActionExecutor.java:57) at org.gradle.internal.concurrent.ExecutorPolicy$CatchAndRecordFailures.onExecute(ExecutorPolicy.java:54) at org.gradle.internal.concurrent.StoppableExecutorImpl$1.run(StoppableExecutorImpl.java:40) at java.util.concurrent.ThreadPoolExecutor.runWorker(Unknown Source) at java.util.concurrent.ThreadPoolExecutor$Worker.run(Unknown Source) at java.lang.Thread.run(Unknown Source) at org.gradle.tooling.internal.consumer.BlockingResultHandler.getResult(BlockingResultHandler.java:46) at org.gradle.tooling.internal.consumer.DefaultModelBuilder.get(DefaultModelBuilder.java:51) at com.gradleware.tooling.toolingclient.internal.DefaultToolingClient.executeAndWait(DefaultToolingClient.java:106) at com.gradleware.tooling.toolingclient.internal.DefaultModelRequest.executeAndWait(DefaultModelRequest.java:79) at com.gradleware.tooling.toolingmodel.repository.internal.BaseModelRepository$1.get(BaseModelRepository.java:95) at com.gradleware.tooling.toolingmodel.repository.internal.BaseModelRepository.executeAndWait(BaseModelRepository.java:163) at com.gradleware.tooling.toolingmodel.repository.internal.BaseModelRepository.access$000(BaseModelRepository.java:41) at com.gradleware.tooling.toolingmodel.repository.internal.BaseModelRepository$2.call(BaseModelRepository.java:121) at com.google.common.cache.LocalCache$LocalManualCache$1.load(LocalCache.java:4724) at com.google.common.cache.LocalCache$LoadingValueReference.loadFuture(LocalCache.java:3522) at com.google.common.cache.LocalCache$Segment.loadSync(LocalCache.java:2315) at com.google.common.cache.LocalCache$Segment.lockedGetOrLoad(LocalCache.java:2278) at com.google.common.cache.LocalCache$Segment.get(LocalCache.java:2193) at com.google.common.cache.LocalCache.get(LocalCache.java:3932) at com.google.common.cache.LocalCache$LocalManualCache.get(LocalCache.java:4721) at com.gradleware.tooling.toolingmodel.repository.internal.BaseModelRepository.getFromCache(BaseModelRepository.java:138) at com.gradleware.tooling.toolingmodel.repository.internal.BaseModelRepository.executeRequest(BaseModelRepository.java:117) at com.gradleware.tooling.toolingmodel.repository.internal.BaseModelRepository.executeRequest(BaseModelRepository.java:88) at com.gradleware.tooling.toolingmodel.repository.internal.DefaultSingleBuildModelRepository.fetchEclipseGradleBuild(DefaultSingleBuildModelRepository.java:185) at org.eclipse.buildship.core.workspace.internal.DefaultModelProvider.fetchEclipseGradleBuild(DefaultModelProvider.java:53) at org.eclipse.buildship.core.workspace.internal.SynchronizeGradleBuildsJob.synchronizeBuild(SynchronizeGradleBuildsJob.java:77) at org.eclipse.buildship.core.workspace.internal.SynchronizeGradleBuildsJob.runToolingApiJob(SynchronizeGradleBuildsJob.java:69) at org.eclipse.buildship.core.util.progress.ToolingApiJob$1.run(ToolingApiJob.java:73) at org.eclipse.buildship.core.util.progress.ToolingApiInvoker.invoke(ToolingApiInvoker.java:63) at org.eclipse.buildship.core.util.progress.ToolingApiJob.run(ToolingApiJob.java:70) at org.eclipse.core.internal.jobs.Worker.run(Worker.java:55) Caused by: org.gradle.internal.exceptions.LocationAwareException: Execution failed for task ‘:compileTestGroovy’. at org.gradle.initialization.DefaultExceptionAnalyser.transform(DefaultExceptionAnalyser.java:74) at org.gradle.initialization.MultipleBuildFailuresExceptionAnalyser.transform(MultipleBuildFailuresExceptionAnalyser.java:47) at org.gradle.initialization.StackTraceSanitizingExceptionAnalyser.transform(StackTraceSanitizingExceptionAnalyser.java:30) at org.gradle.initialization.DefaultGradleLauncher$1.create(DefaultGradleLauncher.java:121) at org.gradle.initialization.DefaultGradleLauncher$1.create(DefaultGradleLauncher.java:112) at org.gradle.internal.progress.DefaultBuildOperationExecutor.run(DefaultBuildOperationExecutor.java:91) at org.gradle.internal.progress.DefaultBuildOperationExecutor.run(DefaultBuildOperationExecutor.java:63) at org.gradle.initialization.DefaultGradleLauncher.doBuild(DefaultGradleLauncher.java:112) at org.gradle.initialization.DefaultGradleLauncher.run(DefaultGradleLauncher.java:98) at org.gradle.initialization.buildsrc.BuildSrcUpdateFactory.create(BuildSrcUpdateFactory.java:49) at org.gradle.initialization.buildsrc.BuildSrcUpdateFactory.create(BuildSrcUpdateFactory.java:31) at org.gradle.cache.internal.DefaultCacheAccess.useCache(DefaultCacheAccess.java:179) at org.gradle.cache.internal.DefaultPersistentDirectoryStore.useCache(DefaultPersistentDirectoryStore.java:125) at org.gradle.cache.internal.DefaultCacheFactory$ReferenceTrackingCache.useCache(DefaultCacheFactory.java:187) at org.gradle.initialization.buildsrc.BuildSourceBuilder.buildBuildSrc(BuildSourceBuilder.java:90) at org.gradle.initialization.buildsrc.BuildSourceBuilder.access$000(BuildSourceBuilder.java:42) at org.gradle.initialization.buildsrc.BuildSourceBuilder$1.create(BuildSourceBuilder.java:78) at org.gradle.initialization.buildsrc.BuildSourceBuilder$1.create(BuildSourceBuilder.java:75) at org.gradle.internal.progress.DefaultBuildOperationExecutor.run(DefaultBuildOperationExecutor.java:91) at org.gradle.initialization.buildsrc.BuildSourceBuilder.createBuildSourceClasspath(BuildSourceBuilder.java:75) at org.gradle.initialization.buildsrc.BuildSourceBuilder.buildAndCreateClassLoader(BuildSourceBuilder.java:60) at org.gradle.initialization.DefaultSettingsLoader.findSettingsAndLoadIfAppropriate(DefaultSettingsLoader.java:88) at org.gradle.initialization.DefaultSettingsLoader.findAndLoadSettings(DefaultSettingsLoader.java:47) at org.gradle.internal.composite.CompositeBuildSettingsLoader.findAndLoadSettings(CompositeBuildSettingsLoader.java:46) at org.gradle.initialization.NotifyingSettingsLoader.findAndLoadSettings(NotifyingSettingsLoader.java:33) at org.gradle.initialization.DefaultGradleLauncher.doBuildStages(DefaultGradleLauncher.java:148) at org.gradle.initialization.DefaultGradleLauncher.access$200(DefaultGradleLauncher.java:36) at org.gradle.initialization.DefaultGradleLauncher$1.create(DefaultGradleLauncher.java:118) at org.gradle.initialization.DefaultGradleLauncher$1.create(DefaultGradleLauncher.java:112) at org.gradle.internal.progress.DefaultBuildOperationExecutor.run(DefaultBuildOperationExecutor.java:91) at org.gradle.internal.progress.DefaultBuildOperationExecutor.run(DefaultBuildOperationExecutor.java:63) at org.gradle.initialization.DefaultGradleLauncher.doBuild(DefaultGradleLauncher.java:112) at org.gradle.initialization.DefaultGradleLauncher.getBuildAnalysis(DefaultGradleLauncher.java:103) at org.gradle.launcher.exec.GradleBuildController.configure(GradleBuildController.java:74) at org.gradle.tooling.internal.provider.runner.BuildModelActionRunner.run(BuildModelActionRunner.java:54) at org.gradle.launcher.exec.ChainingBuildActionRunner.run(ChainingBuildActionRunner.java:35) at org.gradle.tooling.internal.provider.runner.SubscribableBuildActionRunner.run(SubscribableBuildActionRunner.java:58) at org.gradle.launcher.exec.ChainingBuildActionRunner.run(ChainingBuildActionRunner.java:35) at org.gradle.launcher.exec.InProcessBuildActionExecuter.execute(InProcessBuildActionExecuter.java:41) at org.gradle.launcher.exec.InProcessBuildActionExecuter.execute(InProcessBuildActionExecuter.java:26) at org.gradle.tooling.internal.provider.ContinuousBuildActionExecuter.execute(ContinuousBuildActionExecuter.java:75) at org.gradle.tooling.internal.provider.ContinuousBuildActionExecuter.execute(ContinuousBuildActionExecuter.java:49) at org.gradle.tooling.internal.provider.ServicesSetupBuildActionExecuter.execute(ServicesSetupBuildActionExecuter.java:44) at org.gradle.tooling.internal.provider.ServicesSetupBuildActionExecuter.execute(ServicesSetupBuildActionExecuter.java:29) at org.gradle.launcher.daemon.server.exec.ExecuteBuild.doBuild(ExecuteBuild.java:67) at org.gradle.launcher.daemon.server.exec.BuildCommandOnly.execute(BuildCommandOnly.java:36) at org.gradle.launcher.daemon.server.api.DaemonCommandExecution.proceed(DaemonCommandExecution.java:120) at org.gradle.launcher.daemon.server.exec.WatchForDisconnection.execute(WatchForDisconnection.java:47) at org.gradle.launcher.daemon.server.api.DaemonCommandExecution.proceed(DaemonCommandExecution.java:120) at org.gradle.launcher.daemon.server.exec.ResetDeprecationLogger.execute(ResetDeprecationLogger.java:26) at org.gradle.launcher.daemon.server.api.DaemonCommandExecution.proceed(DaemonCommandExecution.java:120) at org.gradle.launcher.daemon.server.exec.RequestStopIfSingleUsedDaemon.execute(RequestStopIfSingleUsedDaemon.java:34) at org.gradle.launcher.daemon.server.api.DaemonCommandExecution.proceed(DaemonCommandExecution.java:120) at org.gradle.launcher.daemon.server.exec.ForwardClientInput$2.call(ForwardClientInput.java:74) at org.gradle.launcher.daemon.server.exec.ForwardClientInput$2.call(ForwardClientInput.java:72) at org.gradle.util.Swapper.swap(Swapper.java:38) at org.gradle.launcher.daemon.server.exec.ForwardClientInput.execute(ForwardClientInput.java:72) at org.gradle.launcher.daemon.server.api.DaemonCommandExecution.proceed(DaemonCommandExecution.java:120) at org.gradle.launcher.daemon.server.exec.LogAndCheckHealth.execute(LogAndCheckHealth.java:55) at org.gradle.launcher.daemon.server.api.DaemonCommandExecution.proceed(DaemonCommandExecution.java:120) at org.gradle.launcher.daemon.server.exec.LogToClient.doBuild(LogToClient.java:60) at org.gradle.launcher.daemon.server.exec.BuildCommandOnly.execute(BuildCommandOnly.java:36) at org.gradle.launcher.daemon.server.api.DaemonCommandExecution.proceed(DaemonCommandExecution.java:120) at org.gradle.launcher.daemon.server.exec.EstablishBuildEnvironment.doBuild(EstablishBuildEnvironment.java:72) at org.gradle.launcher.daemon.server.exec.BuildCommandOnly.execute(BuildCommandOnly.java:36) at org.gradle.launcher.daemon.server.api.DaemonCommandExecution.proceed(DaemonCommandExecution.java:120) at org.gradle.launcher.daemon.server.exec.StartBuildOrRespondWithBusy$1.run(StartBuildOrRespondWithBusy.java:50) at org.gradle.launcher.daemon.server.DaemonStateCoordinator$1.run(DaemonStateCoordinator.java:293) at org.gradle.internal.concurrent.ExecutorPolicy$CatchAndRecordFailures.onExecute(ExecutorPolicy.java:54) at org.gradle.internal.concurrent.StoppableExecutorImpl$1.run(StoppableExecutorImpl.java:40) Caused by: org.gradle.api.tasks.TaskExecutionException: Execution failed for task ‘:compileTestGroovy’. at org.gradle.api.internal.tasks.execution.ExecuteActionsTaskExecuter.executeActions(ExecuteActionsTaskExecuter.java:84) at org.gradle.api.internal.tasks.execution.ExecuteActionsTaskExecuter.execute(ExecuteActionsTaskExecuter.java:55) at org.gradle.api.internal.tasks.execution.SkipUpToDateTaskExecuter.execute(SkipUpToDateTaskExecuter.java:61) at org.gradle.api.internal.tasks.execution.ValidatingTaskExecuter.execute(ValidatingTaskExecuter.java:58) at org.gradle.api.internal.tasks.execution.SkipEmptySourceFilesTaskExecuter.execute(SkipEmptySourceFilesTaskExecuter.java:88) at org.gradle.api.internal.tasks.execution.ResolveTaskArtifactStateTaskExecuter.execute(ResolveTaskArtifactStateTaskExecuter.java:45) at org.gradle.api.internal.tasks.execution.SkipTaskWithNoActionsExecuter.execute(SkipTaskWithNoActionsExecuter.java:51) at org.gradle.api.internal.tasks.execution.SkipOnlyIfTaskExecuter.execute(SkipOnlyIfTaskExecuter.java:54) at org.gradle.api.internal.tasks.execution.ExecuteAtMostOnceTaskExecuter.execute(ExecuteAtMostOnceTaskExecuter.java:43) at org.gradle.api.internal.tasks.execution.CatchExceptionTaskExecuter.execute(CatchExceptionTaskExecuter.java:34) at org.gradle.execution.taskgraph.DefaultTaskGraphExecuter$EventFiringTaskWorker.execute(DefaultTaskGraphExecuter.java:233) at org.gradle.execution.taskgraph.DefaultTaskGraphExecuter$EventFiringTaskWorker.execute(DefaultTaskGraphExecuter.java:215) at org.gradle.execution.taskgraph.AbstractTaskPlanExecutor$TaskExecutorWorker.processTask(AbstractTaskPlanExecutor.java:74) at org.gradle.execution.taskgraph.AbstractTaskPlanExecutor$TaskExecutorWorker.run(AbstractTaskPlanExecutor.java:55) at org.gradle.execution.taskgraph.DefaultTaskPlanExecutor.process(DefaultTaskPlanExecutor.java:32) at org.gradle.execution.taskgraph.DefaultTaskGraphExecuter.execute(DefaultTaskGraphExecuter.java:113) at org.gradle.execution.SelectedTaskExecutionAction.execute(SelectedTaskExecutionAction.java:37) at org.gradle.execution.DefaultBuildExecuter.execute(DefaultBuildExecuter.java:37) at org.gradle.execution.DefaultBuildExecuter.access$000(DefaultBuildExecuter.java:23) at org.gradle.execution.DefaultBuildExecuter$1.proceed(DefaultBuildExecuter.java:43) at org.gradle.execution.DryRunBuildExecutionAction.execute(DryRunBuildExecutionAction.java:32) at org.gradle.execution.DefaultBuildExecuter.execute(DefaultBuildExecuter.java:37) at org.gradle.execution.DefaultBuildExecuter.execute(DefaultBuildExecuter.java:30) at org.gradle.initialization.DefaultGradleLauncher$4.run(DefaultGradleLauncher.java:197) at org.gradle.internal.Factories$1.create(Factories.java:25) at org.gradle.internal.progress.DefaultBuildOperationExecutor.run(DefaultBuildOperationExecutor.java:91) at org.gradle.internal.progress.DefaultBuildOperationExecutor.run(DefaultBuildOperationExecutor.java:53) at org.gradle.initialization.DefaultGradleLauncher.doBuildStages(DefaultGradleLauncher.java:194) at org.gradle.initialization.DefaultGradleLauncher.access$200(DefaultGradleLauncher.java:36) at org.gradle.initialization.DefaultGradleLauncher$1.create(DefaultGradleLauncher.java:118) … 66 more Caused by: org.gradle.api.internal.tasks.compile.CompilationFailedException: Compilation failed; see the compiler error output for details. at org.gradle.api.internal.tasks.compile.ApiGroovyCompiler.execute(ApiGroovyCompiler.java:179) at org.gradle.api.internal.tasks.compile.ApiGroovyCompiler.execute(ApiGroovyCompiler.java:60) at org.gradle.api.internal.tasks.compile.daemon.CompilerDaemonServer.execute(CompilerDaemonServer.java:31) at org.gradle.process.internal.worker.request.WorkerAction.run(WorkerAction.java:87) at org.gradle.internal.dispatch.ReflectionDispatch.dispatch(ReflectionDispatch.java:35) at org.gradle.internal.dispatch.ReflectionDispatch.dispatch(ReflectionDispatch.java:24) at org.gradle.internal.remote.internal.hub.MessageHub$Handler.run(MessageHub.java:377) … 2 more


(Stefan Oehme) #2

Your buildSrc project has compile errors, which prevents Gradle from getting a model of your project. You need to fix those errors (see the console output) first.