Gradle worker down


(kennak1219) #1

testngのテストはすべて成功しているのですが、 テストレポートの作成でgradle workerが死んでしまいます。

google 翻訳

I have been successful in all test testng, Gradle worker will die in the creation of the test report.

debug log----

18:24:11.323 [DEBUG] [TestEventLogger] Test Run PASSED 18:24:11.332 [DEBUG] [org.gradle.logging.internal.DefaultLoggingConfigurer] Finished configuring with level: DEBUG, configurers: [org.gradle.logging.internal.OutputEventRenderer@45409388, org.gradle.logging.internal.logback.LogbackLoggingConfigurer@1295e93d, org.gradle.logging.internal.JavaUtilLoggingConfigurer@3003ad53] 18:24:11.333 [DEBUG] [org.gradle.api.internal.tasks.execution.ExecuteAtMostOnceTaskExecuter] Finished executing task ‘:testNGTest’ 18:24:11.872 [ERROR] [org.gradle.BuildExceptionReporter]

18:24:11.887 [ERROR] [org.gradle.BuildExceptionReporter] FAILURE: Build failed with an exception. 18:24:11.888 [ERROR] [org.gradle.BuildExceptionReporter]

18:24:11.888 [ERROR] [org.gradle.BuildExceptionReporter] * What went wrong: 18:24:11.889 [ERROR] [org.gradle.BuildExceptionReporter] Execution failed for task ‘:testNGTest’. 18:24:12.082 [ERROR] [org.gradle.BuildExceptionReporter] > Process ‘Gradle Worker 1’ finished with non-zero exit value 1 18:24:12.083 [ERROR] [org.gradle.BuildExceptionReporter]

18:24:12.094 [ERROR] [org.gradle.BuildExceptionReporter] * Exception is: 18:24:12.212 [ERROR] [org.gradle.BuildExceptionReporter] org.gradle.api.tasks.TaskExecutionException: Execution failed for task ‘:testNGTest’. 18:24:12.212 [ERROR] [org.gradle.BuildExceptionReporter] at org.gradle.api.internal.tasks.execution.ExecuteActionsTaskExecuter.executeActions(ExecuteActionsTaskExecuter.java:68) 18:24:12.213 [ERROR] [org.gradle.BuildExceptionReporter] at org.gradle.api.internal.tasks.execution.ExecuteActionsTaskExecuter.execute(ExecuteActionsTaskExecuter.java:46) 18:24:12.214 [ERROR] [org.gradle.BuildExceptionReporter] at org.gradle.api.internal.tasks.execution.PostExecutionAnalysisTaskExecuter.execute(PostExecutionAnalysisTaskExecuter.java:34) 18:24:12.217 [ERROR] [org.gradle.BuildExceptionReporter] at org.gradle.api.internal.changedetection.CacheLockHandlingTaskExecuter$1.run(CacheLockHandlingTaskExecuter.java:34) 18:24:12.218 [ERROR] [org.gradle.BuildExceptionReporter] at org.gradle.cache.internal.DefaultCacheAccess$2.create(DefaultCacheAccess.java:200) 18:24:12.218 [ERROR] [org.gradle.BuildExceptionReporter] at org.gradle.cache.internal.DefaultCacheAccess.longRunningOperation(DefaultCacheAccess.java:172) 18:24:12.219 [ERROR] [org.gradle.BuildExceptionReporter] at org.gradle.cache.internal.DefaultCacheAccess.longRunningOperation(DefaultCacheAccess.java:198) 18:24:12.220 [ERROR] [org.gradle.BuildExceptionReporter] at org.gradle.cache.internal.DefaultPersistentDirectoryStore.longRunningOperation(DefaultPersistentDirectoryStore.java:137) 18:24:12.284 [ERROR] [org.gradle.BuildExceptionReporter] at org.gradle.api.internal.changedetection.DefaultTaskArtifactStateCacheAccess.longRunningOperation(DefaultTaskArtifactStateCacheAccess.java:83) 18:24:12.352 [ERROR] [org.gradle.BuildExceptionReporter] at org.gradle.api.internal.changedetection.CacheLockHandlingTaskExecuter.execute(CacheLockHandlingTaskExecuter.java:32) 18:24:12.352 [ERROR] [org.gradle.BuildExceptionReporter] at org.gradle.api.internal.tasks.execution.SkipUpToDateTaskExecuter.execute(SkipUpToDateTaskExecuter.java:55) 18:24:12.353 [ERROR] [org.gradle.BuildExceptionReporter] at org.gradle.api.internal.tasks.execution.ValidatingTaskExecuter.execute(ValidatingTaskExecuter.java:57) 18:24:12.354 [ERROR] [org.gradle.BuildExceptionReporter] at org.gradle.api.internal.tasks.execution.SkipEmptySourceFilesTaskExecuter.execute(SkipEmptySourceFilesTaskExecuter.java:41) 18:24:12.355 [ERROR] [org.gradle.BuildExceptionReporter] at org.gradle.api.internal.tasks.execution.SkipTaskWithNoActionsExecuter.execute(SkipTaskWithNoActionsExecuter.java:51) 18:24:12.356 [ERROR] [org.gradle.BuildExceptionReporter] at org.gradle.api.internal.tasks.execution.SkipOnlyIfTaskExecuter.execute(SkipOnlyIfTaskExecuter.java:52) 18:24:12.357 [ERROR] [org.gradle.BuildExceptionReporter] at org.gradle.api.internal.tasks.execution.ExecuteAtMostOnceTaskExecuter.execute(ExecuteAtMostOnceTaskExecuter.java:42) 18:24:12.358 [ERROR] [org.gradle.BuildExceptionReporter] at org.gradle.api.internal.AbstractTask.executeWithoutThrowingTaskFailure(AbstractTask.java:247) 18:24:12.359 [ERROR] [org.gradle.BuildExceptionReporter] at org.gradle.execution.DefaultTaskGraphExecuter.executeTask(DefaultTaskGraphExecuter.java:192) 18:24:12.359 [ERROR] [org.gradle.BuildExceptionReporter] at org.gradle.execution.DefaultTaskGraphExecuter.doExecute(DefaultTaskGraphExecuter.java:177) 18:24:12.360 [ERROR] [org.gradle.BuildExceptionReporter] at org.gradle.execution.DefaultTaskGraphExecuter.execute(DefaultTaskGraphExecuter.java:83) 18:24:12.363 [ERROR] [org.gradle.BuildExceptionReporter] at org.gradle.execution.SelectedTaskExecutionAction.execute(SelectedTaskExecutionAction.java:36) 18:24:12.363 [ERROR] [org.gradle.BuildExceptionReporter] at org.gradle.execution.DefaultBuildExecuter.execute(DefaultBuildExecuter.java:61) 18:24:12.364 [ERROR] [org.gradle.BuildExceptionReporter] at org.gradle.execution.DefaultBuildExecuter.access$200(DefaultBuildExecuter.java:23) 18:24:12.364 [ERROR] [org.gradle.BuildExceptionReporter] at org.gradle.execution.DefaultBuildExecuter$2.proceed(DefaultBuildExecuter.java:67) 18:24:12.364 [ERROR] [org.gradle.BuildExceptionReporter] at org.gradle.api.internal.changedetection.TaskCacheLockHandlingBuildExecuter$1.run(TaskCacheLockHandlingBuildExecuter.java:31) 18:24:12.365 [ERROR] [org.gradle.BuildExceptionReporter] at org.gradle.cache.internal.DefaultCacheAccess$1.create(DefaultCacheAccess.java:111) 18:24:12.365 [ERROR] [org.gradle.BuildExceptionReporter] at org.gradle.cache.internal.DefaultCacheAccess.useCache(DefaultCacheAccess.java:126) 18:24:12.365 [ERROR] [org.gradle.BuildExceptionReporter] at org.gradle.cache.internal.DefaultCacheAccess.useCache(DefaultCacheAccess.java:109) 18:24:12.366 [ERROR] [org.gradle.BuildExceptionReporter] at org.gradle.cache.internal.DefaultPersistentDirectoryStore.useCache(DefaultPersistentDirectoryStore.java:129) 18:24:12.366 [ERROR] [org.gradle.BuildExceptionReporter] at org.gradle.api.internal.changedetection.DefaultTaskArtifactStateCacheAccess.useCache(DefaultTaskArtifactStateCacheAccess.java:79) 18:24:12.367 [ERROR] [org.gradle.BuildExceptionReporter] at org.gradle.api.internal.changedetection.TaskCacheLockHandlingBuildExecuter.execute(TaskCacheLockHandlingBuildExecuter.java:29) 18:24:12.386 [ERROR] [org.gradle.BuildExceptionReporter] at org.gradle.execution.DefaultBuildExecuter.execute(DefaultBuildExecuter.java:61) 18:24:12.408 [ERROR] [org.gradle.BuildExceptionReporter] at org.gradle.execution.DefaultBuildExecuter.access$200(DefaultBuildExecuter.java:23) 18:24:12.408 [ERROR] [org.gradle.BuildExceptionReporter] at org.gradle.execution.DefaultBuildExecuter$2.proceed(DefaultBuildExecuter.java:67) 18:24:12.408 [ERROR] [org.gradle.BuildExceptionReporter] at org.gradle.execution.DryRunBuildExecutionAction.execute(DryRunBuildExecutionAction.java:32) 18:24:12.409 [ERROR] [org.gradle.BuildExceptionReporter] at org.gradle.execution.DefaultBuildExecuter.execute(DefaultBuildExecuter.java:61) 18:24:12.409 [ERROR] [org.gradle.BuildExceptionReporter] at org.gradle.execution.DefaultBuildExecuter.execute(DefaultBuildExecuter.java:54) 18:24:12.409 [ERROR] [org.gradle.BuildExceptionReporter] at org.gradle.initialization.DefaultGradleLauncher.doBuildStages(DefaultGradleLauncher.java:155) 18:24:12.441 [ERROR] [org.gradle.BuildExceptionReporter] at org.gradle.initialization.DefaultGradleLauncher.doBuild(DefaultGradleLauncher.java:110) 18:24:12.441 [ERROR] [org.gradle.BuildExceptionReporter] at org.gradle.initialization.DefaultGradleLauncher.run(DefaultGradleLauncher.java:78) 18:24:12.442 [ERROR] [org.gradle.BuildExceptionReporter] at org.gradle.launcher.cli.ExecuteBuildAction.run(ExecuteBuildAction.java:38) 18:24:12.442 [ERROR] [org.gradle.BuildExceptionReporter] at org.gradle.launcher.exec.InProcessGradleLauncherActionExecuter.execute(InProcessGradleLauncherActionExecuter.java:39) 18:24:12.442 [ERROR] [org.gradle.BuildExceptionReporter] at org.gradle.launcher.exec.InProcessGradleLauncherActionExecuter.execute(InProcessGradl


(Peter Niederwieser) #2

Can you provide the cause(s) of the exception? (Run with ‘-S’.) How often do you get this error? Can you provide a reproducible example?


(kennak1219) #3

五回に一回くらいで発生します。

I occurs in about one in five times.

-S log

19:02:19.773 [DEBUG] [org.gradle.messaging.remote.internal.Router]
Removing route 384b1687-5ede-4492-8943-3abcc403fe7e due to end of stream.
19:02:21.682 [DEBUG] [org.gradle.messaging.remote.internal.Router]
Removing route 41ca71f6-0850-4249-adb7-ff8d0ae5e888 due to end of stream.
19:02:21.682 [DEBUG] [org.gradle.messaging.remote.internal.SendProtocol]
Consumer unavailable: [ConsumerUnavailable id: 384b1687-5ede-4492-8943-3abcc403fe7e]
19:02:21.682 [DEBUG] [org.gradle.process.internal.DefaultExecHandle] Changing state to: FAILED
19:02:21.682 [INFO] [org.gradle.process.internal.DefaultExecHandle] Process 'Gradle Worker 1' finished with exit value 1 (state: FAILED)
19:02:22.228 [DEBUG] [org.gradle.messaging.remote.internal.ReceiveProtocol] Producer unavailable: [ProducerUnavailable id: 41ca71f6-0850-4249-adb7-ff8d0ae5e888]
19:02:22.701 [DEBUG] [org.gradle.messaging.remote.internal.ReceiveProtocol] No producers. Stopping now.
19:02:22.702 [DEBUG] [org.gradle.messaging.remote.internal.Router] Received route unavailable. Message: [ConsumerUnavailable id: 3b3aea8d-23e3-4843-bb39-7076fb4fe375]
19:02:22.702 [DEBUG] [org.gradle.messaging.remote.internal.WorkerProtocol] Received worker stopped: [EndOfStreamEvent]
19:02:22.756 [DEBUG] [org.gradle.messaging.remote.internal.SendProtocol] All consumers stopped. Stopping now.
19:02:22.756 [DEBUG] [org.gradle.messaging.remote.internal.Router] Received route unavailable. Message: [ProducerUnavailable id: eea587ea-ab00-4608-a270-4853a74c4820]
19:02:23.661 [QUIET] [system.out]
19:02:23.661 [DEBUG] [TestEventLogger]
19:02:23.661 [DEBUG] [TestEventLogger] Test Run PASSED
19:02:23.777 [DEBUG] [org.gradle.logging.internal.
DefaultLoggingConfigurer] Finished configuring with level: DEBUG,configurers: [org.gradle.logging.internal.OutputEventRenderer@41683cc5,org.gradle.logging.internal.logback.LogbackLoggingConfigurer@226dcb0f,org.gradle.logging.internal.JavaUtilLoggingConfigurer@562e5771]
19:02:23.821 [DEBUG] [org.gradle.api.internal.tasks.execution.ExecuteAtMostOnceTaskExecuter] Finished executing task ':testNGTest'
19:02:25.930 [ERROR] [org.gradle.BuildExceptionReporter]
19:02:25.930 [ERROR] [org.gradle.BuildExceptionReporter] FAILURE: Build
failed with an exception.
19:02:25.930 [ERROR] [org.gradle.BuildExceptionReporter]
19:02:25.930 [ERROR] [org.gradle.BuildExceptionReporter] * What went wrong:
19:02:25.931 [ERROR] [org.gradle.BuildExceptionReporter] Execution failed for task ':testNGTest'.
19:02:25.931 [ERROR] [org.gradle.BuildExceptionReporter] > Process ' Gradle Worker 1' finished with non-zero exit value 1
19:02:25.931 [ERROR] [org.gradle.BuildExceptionReporter]
19:02:25.931 [ERROR] [org.gradle.BuildExceptionReporter] * Exception is:
19:02:25.992 [ERROR] [org.gradle.BuildExceptionReporter] org.gradle.api.tasks.TaskExecutionException: Execution failed for task ':testNGTest'.
19:02:25.992 [ERROR] [org.gradle.BuildExceptionReporter]
      at org.gradle.api.internal.tasks.execution.ExecuteActionsTaskExecuter.executeActions(ExecuteActionsTaskExecuter.java:68)
19:02:25.992 [ERROR] [org.gradle.BuildExceptionReporter]
      at org.gradle.api.internal.tasks.execution.ExecuteActionsTaskExecuter.execute(ExecuteActionsTaskExecuter.java:46)
19:02:25.992 [ERROR] [org.gradle.BuildExceptionReporter]
      at org.gradle.api.internal.tasks.execution.PostExecutionAnalysisTaskExecuter.execute(PostExecutionAnalysisTaskExecuter.java:34)
19:02:25.992 [ERROR] [org.gradle.BuildExceptionReporter]
      at org.gradle.api.internal.changedetection.CacheLockHandlingTaskExecuter$1.run(CacheLockHandlingTaskExecuter.java:34)
19:02:25.992 [ERROR] [org.gradle.BuildExceptionReporter]
      at org.gradle.cache.internal.DefaultCacheAccess$2.create(DefaultCacheAccess.java:200)
19:02:25.992 [ERROR] [org.gradle.BuildExceptionReporter]
      at org.gradle.cache.internal.DefaultCacheAccess.longRunningOperation(DefaultCacheAccess.java:172)
19:02:25.992 [ERROR] [org.gradle.BuildExceptionReporter]
      at org.gradle.cache.internal.DefaultCacheAccess.longRunningOperation(DefaultCacheAccess.java:198)
19:02:25.992 [ERROR] [org.gradle.BuildExceptionReporter]
      at org.gradle.cache.internal.DefaultPersistentDirectoryStore.longRunningOperation(DefaultPersistentDirectoryStore.java:137)
19:02:25.993 [ERROR] [org.gradle.BuildExceptionReporter]
      at org.gradle.api.internal.changedetection.DefaultTaskArtifactStateCacheAccess.longRunningOperation(DefaultTaskArtifactStateCacheAccess.java:83)
19:02:25.993 [ERROR] [org.gradle.BuildExceptionReporter]
      at org.gradle.api.internal.changedetection.CacheLockHandlingTaskExecuter.execute(CacheLockHandlingTaskExecuter.java:32)
19:02:25.993 [ERROR] [org.gradle.BuildExceptionReporter]
      at org.gradle.api.internal.tasks.execution.SkipUpToDateTaskExecuter.execute(SkipUpToDateTaskExecuter.java:55)
19:02:25.993 [ERROR] [org.gradle.BuildExceptionReporter]
      at org.gradle.api.internal.tasks.execution.ValidatingTaskExecuter.execute(ValidatingTaskExecuter.java:57)
19:02:25.993 [ERROR] [org.gradle.BuildExceptionReporter]
      at org.gradle.api.internal.tasks.execution.SkipEmptySourceFilesTaskExecuter.execute(SkipEmptySourceFilesTaskExecuter.java:41)
19:02:25.993 [ERROR] [org.gradle.BuildExceptionReporter]
      at org.gradle.api.internal.tasks.execution.SkipTaskWithNoActionsExecuter.execute(SkipTaskWithNoActionsExecuter.java:51)
19:02:25.993 [ERROR] [org.gradle.BuildExceptionReporter]
      at org.gradle.api.internal.tasks.execution.SkipOnlyIfTaskExecuter.execute(SkipOnlyIfTaskExecuter.java:52)
19:02:25.993 [ERROR] [org.gradle.BuildExceptionReporter]
      at org.gradle.api.internal.tasks.execution.ExecuteAtMostOnceTaskExecuter.execute(ExecuteAtMostOnceTaskExecuter.java:42)
19:02:25.993 [ERROR] [org.gradle.BuildExceptionReporter]
      at org.gradle.api.internal.AbstractTask.executeWithoutThrowingTaskFailure(AbstractTask.java:247)
19:02:25.993 [ERROR] [org.gradle.BuildExceptionReporter]
      at org.gradle.execution.DefaultTaskGraphExecuter.executeTask(DefaultTaskGraphExecuter.java:192)
19:02:25.993 [ERROR] [org.gradle.BuildExceptionReporter]
      at org.gradle.execution.DefaultTaskGraphExecuter.doExecute(DefaultTaskGraphExecuter.java:177)
19:02:25.993 [ERROR] [org.gradle.BuildExceptionReporter]
      at org.gradle.execution.DefaultTaskGraphExecuter.execute(DefaultTaskGraphExecuter.java:
83)
19:02:25.993 [ERROR] [org.gradle.BuildExceptionReporter]
      at org.gradle.execution.SelectedTaskExecutionAction.execute(SelectedTaskExecutionAction.java:36)
19:02:25.994 [ERROR] [org.gradle.BuildExceptionReporter]
      at org.gradle.execution.DefaultBuildExecuter.execute(DefaultBuildExecuter.java:61)
19:02:25.994 [ERROR] [org.gradle.BuildExceptionReporter]
      at org.gradle.execution.DefaultBuildExecuter.access$200(DefaultBuildExecuter.java:23)
19:02:25.994 [ERROR] [org.gradle.BuildExceptionReporter]
      at org.gradle.execution.DefaultBuildExecuter$2.proceed(DefaultBuildExecuter.java:67)
19:02:25.994 [ERROR] [org.gradle.BuildExceptionReporter]
      at org.gradle.api.internal.changedetection.TaskCacheLockHandlingBuildExecuter$1.run(
TaskCacheLockHandlingBuildExecuter.java:31)
19:02:25.994 [ERROR] [org.gradle.BuildExceptionReporter]
      at org.gradle.cache.internal.DefaultCacheAccess$1.create(DefaultCacheAccess.java:111)
19:02:25.994 [ERROR] [org.gradle.BuildExceptionReporter]
      at org.gradle.cache.internal.DefaultCacheAccess.useCache(DefaultCacheAccess.java:126)
19:02:25.995 [ERROR] [org.gradle.BuildExceptionReporter]
      at org.gradle.cache.internal.DefaultCacheAccess.useCache(DefaultCacheAccess.java:109)
19:02:25.995 [ERROR] [org.gradle.BuildExceptionReporter]
      at org.gradle.cache.internal.DefaultPersistentDirectoryStore.useCache(
DefaultPersistentDirectoryStore.java:129)
19:02:25.996 [ERROR] [org.gradle.BuildExceptionReporter]
      at org.gradle.api.internal.changedetection.DefaultTaskArtifactStateCacheAccess.useCache(DefaultTaskArtifactStateCacheAccess.java:79)
19:02:25.996 [ERROR] [org.gradle.BuildExceptionReporter]
      at org.gradle.api.internal.changedetection.TaskCacheLockHandlingBuildExecuter.execute(TaskCacheLockHandlingBuildExecuter.java:29)
19:02:25.997 [ERROR] [org.gradle.BuildExceptionReporter]
      at org.gradle.execution.DefaultBuildExecuter.execute(DefaultBuildExecuter.java:61)
19:02:25.997 [ERROR] [org.gradle.BuildExceptionReporter]
      at org.gradle.execution.DefaultBuildExecuter.access$200(DefaultBuildExecuter.java:23)
19:02:25.997 [ERROR] [org.gradle.BuildExceptionReporter]
      at org.gradle.execution.DefaultBuildExecuter$2.proceed(DefaultBuildExecuter.java:67)
19:02:25.998 [ERROR] [org.gradle.BuildExceptionReporter]
      at org.gradle.execution.DryRunBuildExecutionAction.execute(DryRunBuildExecutionAction.java:32)
19:02:25.998 [ERROR] [org.gradle.BuildExceptionReporter]
      at org.gradle.execution.DefaultBuildExecuter.execute(DefaultBuildExecuter.java:61)
19:02:25.999 [ERROR] [org.gradle.BuildExceptionReporter]
      at org.gradle.execution.DefaultBuildExecuter.execute(DefaultBuildExecuter.java:54)
19:02:25.999 [ERROR] [org.gradle.BuildExceptionReporter]
      at org.gradle.initialization.DefaultGradleLauncher.doBuildStages(DefaultGradleLauncher.java:155)
19:02:26.000 [ERROR] [org.gradle.BuildExceptionReporter]
      at org.gradle.initialization.DefaultGradleLauncher.doBuild(DefaultGradleLauncher.java:110)
19:02:26.000 [ERROR] [org.gradle.BuildExceptionReporter]
      at org.gradle.initialization.DefaultGradleLauncher.run(DefaultGradleLauncher.java:78)
19:02:26.001 [ERROR] [org.gradle.BuildExceptionReporter]
      at org.gradle.launcher.cli.ExecuteBuildAction.run(ExecuteBuildAction.java:38)
19:02:26.002 [ERROR] [org.gradle.BuildExceptionReporter]
      at org.gradle.launcher.exec.InProcessGradleLauncherActionExecuter.execute(InProcessGradleLauncherActionExecuter.java:39)
19:02:26.003 [ERROR] [org.gradle.BuildExceptionReporter]
      at org.gradle.launcher.exec.InProcessGradleLauncherActionExecuter.execute(InProcessGradleLauncherActionExecuter.java:25)
19:02:26.005 [ERROR] [org.gradle.BuildExceptionReporter]
      at org.gradle.launcher.cli.RunBuildAction.run(RunBuildAction.java:50)
19:02:26.006 [ERROR] [org.gradle.BuildExceptionReporter]
      at org.gradle.launcher.cli.ActionAdapter.execute(ActionAdapter.java:30)
19:02:26.006 [ERROR] [org.gradle.BuildExceptionReporter]
      at org.gradle.launcher.cli.ActionAdapter.execute(ActionAdapter.java:22)
19:02:26.007 [ERROR] [org.gradle.BuildExceptionReporter]
      at org.gradle.launcher.cli.CommandLineActionFactory$ParseAndBuildAction.execute(CommandLineActionFactory.java:200)
19:02:26.008 [ERROR] [org.gradle.BuildExceptionReporter]
      at org.gradle.launcher.cli.CommandLineActionFactory$ParseAndBuildAction.execute(CommandLineActionFactory.java:173)
19:02:26.008 [ERROR] [org.gradle.BuildExceptionReporter]
      at org.gradle.launcher.cli.CommandLineActionFactory$WithLogging.execute(CommandLineActionFactory.java:169)
19:02:26.009 [ERROR] [org.gradle.BuildExceptionReporter]
      at org.gradle.launcher.cli.CommandLineActionFactory$WithLogging.execute(CommandLineActionFactory.java:138)
19:02:26.009 [ERROR] [org.gradle.BuildExceptionReporter]
      at org.gradle.launcher.cli.ExceptionReportingAction.execute(ExceptionReportingAction.java:33)
19:02:26.010 [ERROR] [org.gradle.BuildExceptionReporter]
      at org.gradle.launcher.cli.ExceptionReportingAction.execute(ExceptionReportingAction.java:22)
19:02:26.010 [ERROR] [org.gradle.BuildExceptionReporter]
      at org.gradle.launcher.Main.doAction(Main.java:48)
19:02:26.011 [ERROR] [org.gradle.BuildExceptionReporter]
      at org.gradle.launcher.bootstrap.EntryPoint.run(EntryPoint.java:45)
19:02:26.012 [ERROR] [org.gradle.BuildExceptionReporter]
      at org.gradle.launcher.Main.main(Main.java:39)
19:02:26.012 [ERROR] [org.gradle.BuildExceptionReporter]
      at sun.reflect.NativeMethodAccessorImpl.invoke0(Native Method)
19:02:26.013 [ERROR] [org.gradle.BuildExceptionReporter]
      at sun.reflect.NativeMethodAccessorImpl.invoke(NativeMethodAccessorImpl.java:57)
19:02:26.013 [ERROR] [org.gradle.BuildExceptionReporter]
      at sun.reflect.DelegatingMethodAccessorImpl.invoke(DelegatingMethodAccessorImpl.java:43)
19:02:26.014 [ERROR] [org.gradle.BuildExceptionReporter]
      at java.lang.reflect.Method.invoke(Method.java:601)
19:02:26.015 [ERROR] [org.gradle.BuildExceptionReporter]
      at org.gradle.launcher.bootstrap.ProcessBootstrap.runNoExit(ProcessBootstrap.java:50)
19:02:26.015 [ERROR] [org.gradle.BuildExceptionReporter]
      at org.gradle.launcher.bootstrap.ProcessBootstrap.run(ProcessBootstrap.java:32)
19:02:26.016 [ERROR] [org.gradle.BuildExceptionReporter]
      at org.gradle.launcher.GradleMain.main(GradleMain.java:26)
19:02:26.017 [ERROR] [org.gradle.BuildExceptionReporter] Caused by: org.gradle.process.internal.ExecException: Process 'Gradle Worker 1' finished with non-zero exit value 1
19:02:26.018 [ERROR] [org.gradle.BuildExceptionReporter]
      at org.gradle.process.internal.DefaultExecHandle$ExecResultImpl.assertNormalExitValue(DefaultExecHandle.java:363)
19:02:26.018 [ERROR] [org.gradle.BuildExceptionReporter]
      at org.gradle.process.internal.DefaultWorkerProcess.waitForStop(DefaultWorkerProcess.java:145)
19:02:26.019 [ERROR] [org.gradle.BuildExceptionReporter]
      at org.gradle.api.internal.tasks.testing.worker.ForkingTestClassProcessor.stop(ForkingTestClassProcessor.java:77)
19:02:26.019 [ERROR] [org.gradle.BuildExceptionReporter]
      at org.gradle.api.internal.tasks.testing.processors.RestartEveryNTestClassProcessor.endBatch(RestartEveryNTestClassProcessor.java:60)
19:02:26.020 [ERROR] [org.gradle.BuildExceptionReporter]
      at org.gradle.api.internal.tasks.testing.processors.RestartEveryNTestClassProcessor.stop(RestartEveryNTestClassProcessor.java:54)
19:02:26.021 [ERROR] [org.gradle.BuildExceptionReporter]
      at sun.reflect.NativeMethodAccessorImpl.invoke0(Native Method)
19:02:26.022 [ERROR] [org.gradle.BuildExceptionReporter]
      at sun.reflect.NativeMethodAccessorImpl.invoke(NativeMethodAccessorImpl.java:57)
19:02:26.022 [ERROR] [org.gradle.BuildExceptionReporter]
      at sun.reflect.DelegatingMethodAccessorImpl.invoke(DelegatingMethodAccessorImpl.java:43)
19:02:26.023 [ERROR] [org.gradle.BuildExceptionReporter]
      at java.lang.reflect.Method.invoke(Method.java:601)
19:02:26.024 [ERROR] [org.gradle.BuildExceptionReporter]
      at org.gradle.messaging.dispatch.ReflectionDispatch.dispatch(ReflectionDispatch.java:35)
19:02:26.025 [ERROR] [org.gradle.BuildExceptionReporter]
      at org.gradle.messaging.dispatch.ReflectionDispatch.dispatch(ReflectionDispatch.java:24)
19:02:26.025 [ERROR] [org.gradle.BuildExceptionReporter]
      at org.gradle.messaging.dispatch.FailureHandlingDispatch.dispatch(FailureHandlingDispatch.java:29)
19:02:26.026 [ERROR] [org.gradle.BuildExceptionReporter]
      at org.gradle.messaging.dispatch.AsyncDispatch.dispatchMessages(AsyncDispatch.java:132)
19:02:26.027 [ERROR] [org.gradle.BuildExceptionReporter]
      at org.gradle.messaging.dispatch.AsyncDispatch.access$000(AsyncDispatch.java:33)
19:02:26.027 [ERROR] [org.gradle.BuildExceptionReporter]
      at org.gradle.messaging.dispatch.AsyncDispatch$1.run(AsyncDispatch.java:72)
19:02:26.027 [ERROR] [org.gradle.BuildExceptionReporter]
      at org.gradle.internal.concurrent.DefaultExecutorFactory$StoppableExecutorImpl$1.run(DefaultExecutorFactory.java:66)
19:02:26.028 [ERROR] [org.gradle.BuildExceptionReporter]
      at java.util.concurrent.ThreadPoolExecutor.runWorker(ThreadPoolExecutor.java:1110)
19:02:26.029 [ERROR] [org.gradle.BuildExceptionReporter]
      at java.util.concurrent.ThreadPoolExecutor$Worker.run(ThreadPoolExecutor.java:603)
19:02:26.029 [ERROR] [org.gradle.BuildExceptionReporter]
      at java.lang.Thread.run(Thread.java:722)
19:02:26.030 [ERROR] [org.gradle.BuildExceptionReporter]
19:02:26.030 [LIFECYCLE] [org.gradle.BuildResultLogger]
19:02:26.039 [LIFECYCLE] [org.gradle.BuildResultLogger] BUILD FAILED
19:02:26.040 [LIFECYCLE] [org.gradle.BuildResultLogger]
19:02:26.040 [LIFECYCLE] [org.gradle.BuildResultLogger] Total time: 6 mins 32.512 secs
19:02:26.453 [DEBUG] [org.gradle.cache.internal.DefaultFileLockManager]
Releasing lock on cache directory workerMain (/root/.gradle/caches/1.1/
workerMain).

(kennak1219) #4

------------------------------------------------------------ Gradle 1.1 ------------------------------------------------------------

Gradle build time: 2012年7月31日 13時24分32秒 UTC Groovy: 1.8.6 Ant: Apache Ant™ version 1.8.4 compiled on May 22 2012 Ivy: 2.2.0 JVM: 1.7.0_07 (Oracle Corporation 23.3-b01) OS: Linux 2.6.32-279.el6.x86_64 amd64


(Peter Niederwieser) #5

Can you also post the stack trace, including causes (’-S’)? Please wrap all build output in HTML code tags.