Game maker error export to android A problem occurred evaluating project ''

sorry for my bad english ,game maker studio 2 , export to android make the erro:

FAILURE: Build failed with an exception.

  • Where:
    Build file ‘T:\\build.gradle’ line: 62

  • What went wrong:
    A problem occurred evaluating project ‘’.

Could not find method implementation() for arguments [androidx.legacy:legacy-support-v4:1.0.0] on object of type org.gradle.api.internal.artifacts.dsl.dependencies.DefaultDependencyHandler.

  • Try:
    Run with --stacktrace option to get the stack trace. Run with --info or --debug option to get more log output. Run with --scan to get full insights.

  • Get more help at

BUILD FAILED in 4m 47s

C:\Windows\system32\cmd.exe DONE (1)
C:\Windows\system32\subst.exe /d T:

C:\Windows\system32\subst.exe DONE (0)
Error : Build Failed
Igor complete.
elapsed time 00:05:37.0222569s for command “C:\ProgramData/GameMakerStudio2/Cache/runtimes\runtime-” -j=8 -options=“C:\Users\klebe_000\AppData\Local\GameMakerStudio2\GMS2TEMP\build.bff” -v – Android Package started at 12/09/2020 16:51:29
“cmd” /c subst W: /d

elapsed time 00:00:00.1310872s for command “cmd” /c subst W: /d started at 12/09/2020 16:57:06
“cmd” /c subst V: /d

elapsed time 00:00:00.1310889s for command “cmd” /c subst V: /d started at 12/09/2020 16:57:06
“cmd” /c subst U: /d

elapsed time 00:00:00.1582363s for command “cmd” /c subst U: /d started at 12/09/2020 16:57:06
FAILED: Package Program Complete
For the details of why this build failed, please review the whole log above and also see your Compile Errors window.