Findbus plugin down


(kennak1219) #1

OK findbugs {

toolVersion = ‘1.3.9’

effort = ‘max’

omitVisitors = [‘LoadOfKnownNullValue’, ‘Naming’] }

NG findbugs {

toolVersion = “2.0.1”

effort = ‘max’

omitVisitors = [‘LoadOfKnownNullValue’, ‘Naming’] }

env ------------------------------------------------------------ Gradle 1.2-rc-1 ------------------------------------------------------------

Gradle build time: 2012年9月4日 17時49分54秒 UTC Groovy: 1.8.6 Ant: Apache Ant™ version 1.8.4 compiled on May 22 2012 Ivy: 2.2.0 JVM: 1.7.0_07 (Oracle Corporation 23.3-b01) OS: Linux 2.6.32-279.el6.x86_64 amd64

NG log

Pass 2: Analyzing classes (1830 / 1830) - 100% complete 16:17:37.924 [DEBUG] [system.out] 16:17:37.924 [QUIET] [system.out] Done with analysis 16:17:38.632 [DEBUG] [system.err] 16:17:38.632 [ERROR] [system.err] The following errors occurred during analysis: 16:17:38.633 [DEBUG] [system.err] 16:17:38.633 [ERROR] [edu.umd.cs. findbugs.TextUIBugReporter] For jp.co.sei.is.lib21.sub.SeiGetParam. getTrace()Ljava/io/BufferedOutputStream;, mismatch on existence of backedge: true for precomputation, false for bytecode analysis 16:17:38.634 [DEBUG] [system.err] 16:17:38.634 [ERROR] [system.err]

For jp.co.sei.is.lib21.sub.SeiGetParam.getTrace()Ljava/io/ BufferedOutputStream;, mismatch on existence of backedge: true for precomputation, false for bytecode analysis 16:17:38.663 [DEBUG] [system.out] 16:17:38.643 [DEBUG] [org.gradle. messaging.remote.internal.SendProtocol] Starting producer 99e1bcb5-91b4- 4a2b-a491-a809f1f275a3 16:17:38.683 [DEBUG] [system.out] 16:17:38.682 [DEBUG] [org.gradle. messaging.remote.internal.Router] Received route available. Message: [ ProducerAvailable id: 99e1bcb5-91b4-4a2b-a491-a809f1f275a3, displayName: message client, channel: org.gradle.api.plugins.quality.internal. findbugs.FindBugsWorkerClientProtocol] 16:17:38.684 [DEBUG] [system.out] 16:17:38.684 [DEBUG] [org.gradle. messaging.remote.internal.SendProtocol] Consumer available: [ ConsumerAvailable id: f1b7d9dd-6914-4b7b-80cd-df2980307498, displayName: message server, channel: org.gradle.api.plugins.quality.internal. findbugs.FindBugsWorkerClientProtocol] 16:17:38.687 [DEBUG] [system.out] 16:17:38.687 [DEBUG] [org.gradle. process.internal.child.ActionExecutionWorker] Completed Gradle Worker 1. 16:17:38.688 [DEBUG] [system.out] 16:17:38.688 [DEBUG] [org.gradle. process.internal.child.ActionExecutionWorker] Stopping client connection. 16:17:38.689 [DEBUG] [org.gradle.messaging.remote.internal.Router] Received route available. Message: [ProducerAvailable id: 99e1bcb5-91b4- 4a2b-a491-a809f1f275a3, displayName: message client, channel: org.gradle. api.plugins.quality.internal.findbugs.FindBugsWorkerClientProtocol] 16:17:38.690 [DEBUG] [system.out] 16:17:38.690 [DEBUG] [org.gradle. messaging.remote.internal.UnicastSendProtocol] Waiting for outgoing messages to be dispatched to a consumer. 16:17:38.726 [DEBUG] [org.gradle.messaging.remote.internal. ReceiveProtocol] Producer ready: [ProducerReady producerId: 99e1bcb5- 91b4-4a2b-a491-a809f1f275a3, consumerId: f1b7d9dd-6914-4b7b-80cd- df2980307498 16:17:38.730 [DEBUG] [system.out] 16:17:38.730 [DEBUG] [org.gradle. messaging.remote.internal.SendProtocol] Consumer ready: [ConsumerReady, consumerId: f1b7d9dd-6914-4b7b-80cd-df2980307498, producerId: 99e1bcb5- 91b4-4a2b-a491-a809f1f275a3] 16:17:38.730 [DEBUG] [system.out] 16:17:38.730 [DEBUG] [org.gradle. messaging.remote.internal.UnicastSendProtocol] Consumer available: [ ConsumerAvailable id: f1b7d9dd-6914-4b7b-80cd-df2980307498, displayName: message server, channel: org.gradle.api.plugins.quality.internal. findbugs.FindBugsWorkerClientProtocol] 16:17:38.732 [DEBUG] [system.out] 16:17:38.730 [DEBUG] [org.gradle. messaging.remote.internal.UnicastSendProtocol] Queued messages dispatched. Stopping now. 16:17:38.732 [DEBUG] [system.out] 16:17:38.731 [DEBUG] [org.gradle. messaging.remote.internal.SendProtocol] Waiting for consumers to stop: [ f1b7d9dd-6914-4b7b-80cd-df2980307498] 16:17:38.779 [DEBUG] [org.gradle.messaging.remote.internal. WorkerProtocol] Dispatching request to worker: [Request consumer: f1b7d9dd-6914-4b7b-80cd-df2980307498, payload: [MethodInvocation method: executed()]] 16:17:38.779 [DEBUG] [org.gradle.messaging.remote.internal. ReceiveProtocol] Producer stopped: [ProducerStopped producerId: 99e1bcb5 -91b4-4a2b-a491-a809f1f275a3, consumerId: f1b7d9dd-6914-4b7b-80cd- df2980307498 16:17:38.783 [DEBUG] [system.out] 16:17:38.781 [DEBUG] [org.gradle. messaging.remote.internal.SendProtocol] Consumer stopped: [ ConsumerStopped, consumerId: f1b7d9dd-6914-4b7b-80cd-df2980307498, producerId: 99e1bcb5-91b4-4a2b-a491-a809f1f275a3] 16:17:38.783 [DEBUG] [system.out] 16:17:38.782 [DEBUG] [org.gradle. messaging.remote.internal.SendProtocol] All consumers stopped. Stopping now. 16:17:38.783 [DEBUG] [system.out] 16:17:38.783 [DEBUG] [org.gradle. messaging.remote.internal.Router] Received route unavailable. Message: [ ProducerUnavailable id: 99e1bcb5-91b4-4a2b-a491-a809f1f275a3] 16:17:38.787 [DEBUG] [org.gradle.messaging.remote.internal.Router] Received route unavailable. Message: [ProducerUnavailable id: 99e1bcb5- 91b4-4a2b-a491-a809f1f275a3] 16:17:38.787 [DEBUG] [org.gradle.messaging.remote.internal. ReceiveProtocol] Producer unavailable: [ProducerUnavailable id: 99e1bcb5 -91b4-4a2b-a491-a809f1f275a3] 16:17:38.825 [DEBUG] [system.out] 16:17:38.825 [DEBUG] [org.gradle. messaging.remote.internal.Router] Removing route f1b7d9dd-6914-4b7b-80cd -df2980307498 due to end of stream. 16:17:38.934 [DEBUG] [org.gradle.process.internal.DefaultExecHandle] Changing state to: SUCCEEDED 16:17:38.935 [INFO] [org.gradle.process.internal.DefaultExecHandle] Process ‘Gradle Worker 1’ finished with exit value 0 (state: SUCCEEDED) 16:17:38.936 [DEBUG] [org.gradle.messaging.remote.internal. ReceiveProtocol] No producers. Stopping now. 16:17:38.936 [DEBUG] [org.gradle.messaging.remote.internal. WorkerProtocol] Received worker stopped: [EndOfStreamEvent] 16:17:38.936 [DEBUG] [org.gradle.messaging.remote.internal.Router] Received route unavailable. Message: [ConsumerUnavailable id: f1b7d9dd- 6914-4b7b-80cd-df2980307498] 16:17:38.949 [DEBUG] [org.gradle.logging.internal. DefaultLoggingConfigurer] Finished configuring with level: DEBUG, configurers: [org.gradle.logging.internal.OutputEventRenderer@3932f2b2, org.gradle.logging.internal.logback.LogbackLoggingConfigurer@3fdba174, org.gradle.logging.internal.JavaUtilLoggingConfigurer@6c44e76c] 16:17:38.949 [DEBUG] [org.gradle.api.internal.tasks.execution. ExecuteAtMostOnceTaskExecuter] Finished executing task ‘:findbugsMain’ 16:17:38.949 [LIFECYCLE] [org.gradle.TaskExecutionLogger] :findbugsMain FAILED 16:17:38.952 [ERROR] [org.gradle.BuildExceptionReporter] 16:17:38.952 [ERROR] [org.gradle.BuildExceptionReporter] FAILURE: Build failed with an exception. 16:17:38.952 [ERROR] [org.gradle.BuildExceptionReporter] 16:17:38.952 [ERROR] [org.gradle.BuildExceptionReporter] * What went wrong: 16:17:38.952 [ERROR] [org.gradle.BuildExceptionReporter] Execution failed for task ‘:findbugsMain’. 16:17:38.952 [ERROR] [org.gradle.BuildExceptionReporter] > FindBugs encountered an error. Run with --debug to get more information. 16:17:38.953 [ERROR] [org.gradle.BuildExceptionReporter] 16:17:38.953 [ERROR] [org.gradle.BuildExceptionReporter] * Exception is: 16:17:38.953 [ERROR] [org.gradle.BuildExceptionReporter] org.gradle.api. tasks.TaskExecutionException: Execution failed for task ‘:findbugsMain’. 16:17:38.953 [ERROR] [org.gradle.BuildExceptionReporter]

at org.gradle. api.internal.tasks.execution.ExecuteActionsTaskExecuter.executeActions( ExecuteActionsTaskExecuter.java:68) 16:17:38.953 [ERROR] [org.gradle.BuildExceptionReporter]

at org.gradle. api.internal.tasks.execution.ExecuteActionsTaskExecuter.execute( ExecuteActionsTaskExecuter.java:46) 16:17:38.954 [ERROR] [org.gradle.BuildExceptionReporter]

at org.gradle. api.internal.tasks.execution.PostExecutionAnalysisTaskExecuter.execute( PostExecutionAnalysisTaskExecuter.java:34) 16:17:38.954 [ERROR] [org.gradle.BuildExceptionReporter]

at org.gradle. api.internal.changedetection.CacheLockHandlingTaskExecuter$1.run( CacheLockHandlingTaskExecuter.java:34) 16:17:38.954 [ERROR] [org.gradle.BuildExceptionReporter]

at org.gradle. cache.internal.DefaultCacheAccess$3.create(DefaultCacheAccess.java:243) 16:17:38.954 [ERROR] [org.gradle.BuildExceptionReporter]

at org.gradle. cache.internal.DefaultCacheAccess.longRunningOperation( DefaultCacheAccess.java:188) 16:17:38.954 [ERROR] [org.gradle.BuildExceptionReporter]

at org.gradle. cache.internal.DefaultCacheAccess.longRunningOperation( DefaultCacheAccess.java:241) 16:17:38.954 [ERROR] [org.gradle.BuildExceptionReporter]

at org.gradle. cache.internal.DefaultPersistentDirectoryStore.longRunningOperation( DefaultPersistentDirectoryStore.java:137) 16:17:38.954 [ERROR] [org.gradle.BuildExceptionReporter]

at org.gradle. api.internal.changedetection.DefaultTaskArtifactStateCacheAccess. longRunningOperation(DefaultTaskArtifactStateCacheAccess.java:83) 16:17:38.954 [ERROR] [org.gradle.BuildExceptionReporter]

at org.gradle. api.internal.changedetection.CacheLockHandlingTaskExecuter.execute( CacheLockHandlingTaskExecuter.java:32) 16:17:38.954 [ERROR] [org.gradle.BuildExceptionReporter]

at org.gradle. api.internal.tasks.execution.SkipUpToDateTaskExecuter.execute( SkipUpToDateTaskExecuter.java:55) 16:17:38.954 [ERROR] [org.gradle.BuildExceptionReporter]

at org.gradle. api.internal.tasks.execution.ValidatingTaskExecuter.execute( ValidatingTaskExecuter.java:57) 16:17:38.954 [ERROR] [org.gradle.BuildExceptionReporter]

at org.gradle. api.internal.tasks.execution.SkipEmptySourceFilesTaskExecuter.execute( SkipEmptySourceFilesTaskExecuter.java:41) 16:17:38.954 [ERROR] [org.gradle.BuildExceptionReporter]

at org.gradle. api.internal.tasks.execution.SkipTaskWithNoActionsExecuter.execute( SkipTaskWithNoActionsExecuter.java:51) 16:17:38.954 [ERROR] [org.gradle.BuildExceptionReporter]

at org.gradle. api.internal.tasks.execution.SkipOnlyIfTaskExecuter.execute( SkipOnlyIfTaskExecuter.java:52) 16:17:38.954 [ERROR] [org.gradle.BuildExceptionReporter]

at org.gradle. api.internal.tasks.execution.ExecuteAtMostOnceTaskExecuter.execute( ExecuteAtMostOnceTaskExecuter.java:42) 16:17:38.954 [ERROR] [org.gradle.BuildExceptionReporter]

at org.gradle. api.internal.AbstractTask.executeWithoutThrowingTaskFailure(AbstractTask. java:247) 16:17:38.954 [ERROR] [org.gradle.BuildExceptionReporter]

at org.gradle. execution.taskgraph.DefaultTaskPlanExecutor.executeTask( DefaultTaskPlanExecutor.java:52) 16:17:38.954 [ERROR] [org.gradle.BuildExceptionReporter]

at org.gradle. execution.taskgraph.DefaultTaskPlanExecutor.processTask( DefaultTaskPlanExecutor.java:38) 16:17:38.954 [ERROR] [org.gradle.BuildExceptionReporter]

at org.gradle. execution.taskgraph.DefaultTaskPlanExecutor.process( DefaultTaskPlanExecutor.java:30) 16:17:38.954 [ERROR] [org.gradle.BuildExceptionReporter]

at org.gradle. execution.taskgraph.DefaultTaskGraphExecuter.execute( DefaultTaskGraphExecuter.java:83) 16:17:38.954 [ERROR] [org.gradle.BuildExceptionReporter]

at org.gradle. execution.SelectedTaskExecutionAction.execute( SelectedTaskExecutionAction.java:29) 16:17:38.954 [ERROR] [org.gradle.BuildExceptionReporter]

at org.gradle. execution.DefaultBuildExecuter.execute(DefaultBuildExecuter.java:61) 16:17:38.955 [ERROR] [org.gradle.BuildExceptionReporter]

at org.gradle. execution.DefaultBuildExecuter.access$200(DefaultBuildExecuter.java:23) 16:17:38.955 [ERROR] [org.gradle.BuildExceptionReporter]

at org.gradle. execution.DefaultBuildExecuter$2.proceed(DefaultBuildExecuter.java:67) 16:17:38.955 [ERROR] [org.gradle.BuildExceptionReporter]

at org.gradle. api.internal.changedetection.TaskCacheLockHandlingBuildExecuter$1.run( TaskCacheLockHandlingBuildExecuter.java:31) 16:17:38.955 [ERROR] [org.gradle.BuildExceptionReporter]

at org.gradle. cache.internal.DefaultCacheAccess$2.create(DefaultCacheAccess.java:118) 16:17:38.955 [ERROR] [org.gradle.BuildExceptionReporter]

at org.gradle. cache.internal.DefaultCacheAccess.useCache(DefaultCacheAccess.java:133) 16:17:38.955 [ERROR] [org.gradle.BuildExceptionReporter]

at org.gradle. cache.internal.DefaultCacheAccess.useCache(DefaultCacheAccess.java:116) 16:17:38.955 [ERROR] [org.gradle.BuildExceptionReporter]

at org.gradle. cache.internal.DefaultPersistentDirectoryStore.useCache( DefaultPersistentDirectoryStore.java:129) 16:17:38.955 [ERROR] [org.gradle.BuildExceptionReporter]

at org.gradle. api.internal.changedetection.DefaultTaskArtifactStateCacheAccess. useCache(DefaultTaskArtifactStateCacheAccess.java:79) 16:17:38.955 [ERROR] [org.gradle.BuildExceptionReporter]

at org.gradle. api.internal.changedetection.TaskCacheLockHandlingBuildExecuter.execute( TaskCacheLockHandlingBuildExecuter.java:29) 16:17:38.955 [ERROR] [org.gradle.BuildExceptionReporter]

at org.gradle. execution.DefaultBuildExecuter.execute(DefaultBuildExecuter.java:61) 16:17:38.955 [ERROR] [org.gradle.BuildExceptionReporter]

at org.gradle. execution.DefaultBuildExecuter.access$200(DefaultBuildExecuter.java:23) 16:17:38.955 [ERROR] [org.gradle.BuildExceptionReporter]

at org.gradle. execution.DefaultBuildExecuter$2.proceed(DefaultBuildExecuter.java:67) 16:17:38.955 [ERROR] [org.gradle.BuildExceptionReporter]

at org.gradle. execution.DryRunBuildExecutionAction.execute(DryRunBuildExecutionAction. java:32) 16:17:38.955 [ERROR] [org.gradle.BuildExceptionReporter]

at org.gradle. execution.DefaultBuildExecuter.execute(DefaultBuildExecuter.java:61) 16:17:38.955 [ERROR] [org.gradle.BuildExceptionReporter]

at org.gradle. execution.DefaultBuildExecuter.execute(DefaultBuildExecuter.java:54) 16:17:38.955 [ERROR] [org.gradle.BuildExceptionReporter]

at org.gradle. initialization.DefaultGradleLauncher.doBuildStages(DefaultGradleLauncher. java:158) 16:17:38.955 [ERROR] [org.gradle.BuildExceptionReporter]

at org.gradle. initialization.DefaultGradleLauncher.doBuild(DefaultGradleLauncher.java: 113) 16:17:38.956 [ERROR] [org.gradle.BuildExceptionReporter]

at org.gradle. initialization.DefaultGradleLauncher.run(DefaultGradleLauncher.java:81) 16:17:38.956 [ERROR] [org.gradle.BuildExceptionReporter]

at org.gradle. launcher.cli.ExecuteBuildAction.run(ExecuteBuildAction.java:38) 16:17:38.956 [ERROR] [org.gradle.BuildExceptionReporter]

at org.gradle. launcher.exec.InProcessGradleLauncherActionExecuter.execute( InProcessGradleLauncherActionExecuter.java:39) 16:17:38.956 [ERROR] [org.gradle.BuildExceptionReporter]

at org.gradle. launcher.exec.InProcessGradleLauncherActionExecuter.execute( InProcessGradleLauncherActionExecuter.java:25) 16:17:38.956 [ERROR] [org.gradle.BuildExceptionReporter]

at org.gradle. launcher.cli.RunBuildAction.run(RunBuildAction.java:50) 16:17:38.956 [ERROR] [org.gradle.BuildExceptionReporter]

at org.gradle. launcher.cli.ActionAdapter.execute(ActionAdapter.java:30) 16:17:38.956 [ERROR] [org.gradle.BuildExceptionReporter]

at org.gradle. launcher.cli.ActionAdapter.execute(ActionAdapter.java:22) 16:17:38.956 [ERROR] [org.gradle.BuildExceptionReporter]

at org.gradle. launcher.cli.CommandLineActionFactory$ParseAndBuildAction.execute( CommandLineActionFactory.java:200) 16:17:38.956 [ERROR] [org.gradle.BuildExceptionReporter]

at org.gradle. launcher.cli.CommandLineActionFactory$ParseAndBuildAction.execute( CommandLineActionFactory.java:173) 16:17:38.956 [ERROR] [org.gradle.BuildExceptionReporter]

at org.gradle. launcher.cli.CommandLineActionFactory$WithLogging.execute( CommandLineActionFactory.java:169) 16:17:38.956 [ERROR] [org.gradle.BuildExceptionReporter]

at org.gradle. launcher.cli.CommandLineActionFactory$WithLogging.execute( CommandLineActionFactory.java:138) 16:17:38.956 [ERROR] [org.gradle.BuildExceptionReporter]

at org.gradle. launcher.cli.ExceptionReportingAction.execute(ExceptionReportingAction. java:33) 16:17:38.956 [ERROR] [org.gradle.BuildExceptionReporter]

at org.gradle. launcher.cli.ExceptionReportingAction.execute(ExceptionReportingAction. java:22) 16:17:38.956 [ERROR] [org.gradle.BuildExceptionReporter]

at org.gradle. launcher.Main.doAction(Main.java:48) 16:17:38.956 [ERROR] [org.gradle.BuildExceptionReporter]

at org.gradle. launcher.bootstrap.EntryPoint.run(EntryPoint.java:45) 16:17:38.956 [ERROR] [org.gradle.BuildExceptionReporter]

at org.gradle. launcher.Main.main(Main.java:39) 16:17:38.956 [ERROR] [org.gradle.BuildExceptionReporter]

at sun.reflect. NativeMethodAccessorImpl.invoke0(Native Method) 16:17:38.956 [ERROR] [org.gradle.BuildExceptionReporter]

at sun.reflect. NativeMethodAccessorImpl.invoke(NativeMethodAccessorImpl.java:57) 16:17:38.957 [ERROR] [org.gradle.BuildExceptionReporter]

at sun.reflect. DelegatingMethodAccessorImpl.invoke(DelegatingMethodAccessorImpl.java:43) 16:17:38.957 [ERROR] [org.gradle.BuildExceptionReporter]

at java.lang. reflect.Method.invoke(Method.java:601) 16:17:38.957 [ERROR] [org.gradle.BuildExceptionReporter]

at org.gradle. launcher.bootstrap.ProcessBootstrap.runNoExit(ProcessBootstrap.java:50) 16:17:38.957 [ERROR] [org.gradle.BuildExceptionReporter]

at org.gradle. launcher.bootstrap.ProcessBootstrap.run(ProcessBootstrap.java:32) 16:17:38.957 [ERROR] [org.gradle.BuildExceptionReporter]

at org.gradle. launcher.GradleMain.main(GradleMain.java:26) 16:17:38.957 [ERROR] [org.gradle.BuildExceptionReporter] Caused by: org. gradle.api.GradleException: FindBugs encountered an error. Run with – debug to get more information. 16:17:38.957 [ERROR] [org.gradle.BuildExceptionReporter]

at sun.reflect. NativeConstructorAccessorImpl.newInstance0(Native Method) 16:17:38.957 [ERROR] [org.gradle.BuildExceptionReporter]

at sun.reflect. NativeConstructorAccessorImpl.newInstance(NativeConstructorAccessorImpl. java:57) 16:17:38.957 [ERROR] [org.gradle.BuildExceptionReporter]

at sun.reflect. DelegatingConstructorAccessorImpl.newInstance( DelegatingConstructorAccessorImpl.java:45) 16:17:38.957 [ERROR] [org.gradle.BuildExceptionReporter]

at java.lang. reflect.Constructor.newInstance(Constructor.java:525) 16:17:38.957 [ERROR] [org.gradle.BuildExceptionReporter]

at org. codehaus.groovy.reflection.CachedConstructor.invoke(CachedConstructor. java:77) 16:17:38.957 [ERROR] [org.gradle.BuildExceptionReporter]

at org. codehaus.groovy.runtime.callsite.ConstructorSite$ ConstructorSiteNoUnwrapNoCoerce.callConstructor(ConstructorSite.java:102) 16:17:38.957 [ERROR] [org.gradle.BuildExceptionReporter]

at org. codehaus.groovy.runtime.callsite.CallSiteArray.defaultCallConstructor( CallSiteArray.java:54) 16:17:38.957 [ERROR] [org.gradle.BuildExceptionReporter]

at org. codehaus.groovy.runtime.callsite.AbstractCallSite.callConstructor( AbstractCallSite.java:182) 16:17:38.957 [ERROR] [org.gradle.BuildExceptionReporter]

at org. codehaus.groovy.runtime.callsite.AbstractCallSite.callConstructor( AbstractCallSite.java:190) 16:17:38.957 [ERROR] [org.gradle.BuildExceptionReporter]

at org.gradle. api.plugins.quality.FindBugs.evaluateResult(FindBugs.groovy:206) 16:17:38.957 [ERROR] [org.gradle.BuildExceptionReporter]

at sun.reflect. NativeMethodAccessorImpl.invoke0(Native Method) 16:17:38.957 [ERROR] [org.gradle.BuildExceptionReporter]

at sun.reflect. NativeMethodAccessorImpl.invoke(NativeMethodAccessorImpl.java:57) 16:17:38.958 [ERROR] [org.gradle.BuildExceptionReporter]

at sun.reflect. DelegatingMethodAccessorImpl.invoke(DelegatingMethodAccessorImpl.java:43) 16:17:38.958 [ERROR] [org.gradle.BuildExceptionReporter]

at java.lang. reflect.Method.invoke(Method.java:601) 16:17:38.958 [ERROR] [org.gradle.BuildExceptionReporter]

at org. codehaus.groovy.runtime.callsite.PogoMetaMethodSite$ PogoCachedMethodSiteNoUnwrapNoCoerce.invoke(PogoMetaMethodSite.java:267) 16:17:38.958 [ERROR] [org.gradle.BuildExceptionReporter]

at org. codehaus.groovy.runtime.callsite.PogoMetaMethodSite.callCurrent( PogoMetaMethodSite.java:52) 16:17:38.958 [ERROR] [org.gradle.BuildExceptionReporter]

at org. codehaus.groovy.runtime.callsite.CallSiteArray.defaultCallCurrent( CallSiteArray.java:46) 16:17:38.958 [ERROR] [org.gradle.BuildExceptionReporter]

at org. codehaus.groovy.runtime.callsite.AbstractCallSite.callCurrent( AbstractCallSite.java:133) 16:17:38.958 [ERROR] [org.gradle.BuildExceptionReporter]

at org. codehaus.groovy.runtime.callsite.AbstractCallSite.callCurrent( AbstractCallSite.java:141) 16:17:38.958 [ERROR] [org.gradle.BuildExceptionReporter]

at org.gradle. api.plugins.quality.FindBugs.run(FindBugs.groovy:173) 16:17:38.958 [ERROR] [org.gradle.BuildExceptionReporter]

at sun.reflect. NativeMethodAccessorImpl.invoke0(Native Method) 16:17:38.958 [ERROR] [org.gradle.BuildExceptionReporter]

at sun.reflect. NativeMethodAccessorImpl.invoke(NativeMethodAccessorImpl.java:57) 16:17:38.958 [ERROR] [org.gradle.BuildExceptionReporter]

at sun.reflect. DelegatingMethodAccessorImpl.invoke(DelegatingMethodAccessorImpl.java:43) 16:17:38.958 [ERROR] [org.gradle.BuildExceptionReporter]

at java.lang. reflect.Method.invoke(Method.java:601) 16:17:38.958 [ERROR] [org.gradle.BuildExceptionReporter]

at org. codehaus.groovy.reflection.CachedMethod.invoke(CachedMethod.java:90) 16:17:38.958 [ERROR] [org.gradle.BuildExceptionReporter]

at groovy.lang. MetaMethod.doMethodInvoke(MetaMethod.java:233) 16:17:38.958 [ERROR] [org.gradle.BuildExceptionReporter]

at groovy.lang. MetaClassImpl.invokeMethod(MetaClassImpl.java:1047) 16:17:38.958 [ERROR] [org.gradle.BuildExceptionReporter]

at groovy.lang. MetaClassImpl.invokeMethod(MetaClassImpl.java:877) 16:17:38.958 [ERROR] [org.gradle.BuildExceptionReporter]

at org.gradle. api.internal.BeanDynamicObject$MetaClassAdapter.invokeMethod( BeanDynamicObject.java:216) 16:17:38.958 [ERROR] [org.gradle.BuildExceptionReporter]

at org.gradle. api.internal.BeanDynamicObject.invokeMethod(BeanDynamicObject.java:122) 16:17:38.959 [ERROR] [org.gradle.BuildExceptionReporter]

at org.gradle. api.internal.CompositeDynamicObject.invokeMethod(CompositeDynamicObject. java:147) 16:17:38.959 [ERROR] [org.gradle.BuildExceptionReporter]

at org.gradle. api.plugins.quality.FindBugs_Decorated.invokeMethod(Unknown Source) 16:17:38.959 [ERROR] [org.gradle.BuildExceptionReporter]

at groovy.lang. GroovyObject$invokeMethod.call(Unknown Source) 16:17:38.959 [ERROR] [org.gradle.BuildExceptionReporter]

at org. codehaus.groovy.runtime.callsite.CallSiteArray.defaultCall(CallSiteArray. java:42) 16:17:38.959 [ERROR] [org.gradle.BuildExceptionReporter]

at groovy.lang. GroovyObject$invokeMethod.call(Unknown Source) 16:17:38.959 [ERROR] [org.gradle.BuildExceptionReporter]

at org.gradle. util.ReflectionUtil.invoke(ReflectionUtil.groovy:23) 16:17:38.959 [ERROR] [org.gradle.BuildExceptionReporter]

at org.gradle. api.internal.project.taskfactory.AnnotationProcessingTaskFactory$4. execute(AnnotationProcessingTaskFactory.java:161) 16:17:38.959 [ERROR] [org.gradle.BuildExceptionReporter]

at org.gradle. api.internal.project.taskfactory.AnnotationProcessingTaskFactory$4. execute(AnnotationProcessingTaskFactory.java:156) 16:17:38.959 [ERROR] [org.gradle.BuildExceptionReporter]

at org.gradle. api.internal.AbstractTask$TaskActionWrapper.execute(AbstractTask.java: 472) 16:17:38.959 [ERROR] [org.gradle.BuildExceptionReporter]

at org.gradle. api.internal.AbstractTask$TaskActionWrapper.execute(AbstractTask.java: 461) 16:17:38.959 [ERROR] [org.gradle.BuildExceptionReporter]

at org.gradle. api.internal.tasks.execution.ExecuteActionsTaskExecuter.executeActions( ExecuteActionsTaskExecuter.java:60) 16:17:38.959 [ERROR] [org.gradle.BuildExceptionReporter]

… 62 more 16:17:38.959 [ERROR] [org.gradle.BuildExceptionReporter] 16:17:38.959 [LIFECYCLE] [org.gradle.BuildResultLogger] 16:17:38.959 [LIFECYCLE] [org.gradle.BuildResultLogger] BUILD FAILED 16:17:38.959 [LIFECYCLE] [org.gradle.BuildResultLogger]


(Peter Niederwieser) #2

Again, we’d at least need the exact error message and complete stack trace to make progress. Even better would be a small self-contained build that exhibits the problem.