FAILURE: Build failed with an exception. help


(Dani Ace Aguila) #1
  • What went wrong:
    Execution failed for task ‘:app:transformClassesWithInstantRunForNoGPlayDebug’.

com.android.build.api.transform.TransformException: java.lang.RuntimeException: java.lang.RuntimeException: java.io.IOException: Failed to find byte code for java/util/function/Predicate

what to do? pls help1!