Error: Androir Studio Gradle Daemon/ FAILURE: Build failed with an exception

Any One Help Me!

FAILURE: Build failed with an exception.

* What went wrong:
Unable to start the daemon process.
This problem might be caused by incorrect configuration of the daemon.
For example, an unrecognized jvm option is used.
Please refer to the User Manual chapter on the daemon at
Process command line: C:\Program Files\Java\jdk-20\bin\java.exe --add-opens java.base/java.util=ALL-UNNAMED --add-opens java.base/java.lang=ALL-UNNAMED --add-opens java.base/java.lang.invoke=ALL-UNNAMED --add-opens java.base/java.util=ALL-UNNAMED --add-opens java.prefs/java.util.prefs=ALL-UNNAMED --add-opens java.prefs/java.util.prefs=ALL-UNNAMED --add-opens java.base/java.nio.charset=ALL-UNNAMED --add-opens java.base/ --add-opens java.base/java.util.concurrent.atomic=ALL-UNNAMED -Xmx1536M -Dfile.encoding=UTF-8 -Duser.language=en -Duser.variant -cp C:\Users\H?DI\.gradle\wrapper\dists\gradle-7.5-all\6qsw290k5lz422uaf8jf6m7co\gradle-7.5\lib\gradle-launcher-7.5.jar org.gradle.launcher.daemon.bootstrap.GradleDaemon 7.5
Please read the following process output to find out more:
Error: Could not find or load main class org.gradle.launcher.daemon.bootstrap.GradleDaemon
Caused by: java.lang.ClassNotFoundException: org.gradle.launcher.daemon.bootstrap.GradleDaemon

* Try:
> Run with --stacktrace option to get the stack trace.
> Run with --info or --debug option to get more log output.
> Run with --scan to get full insights.

* Get more help at
Exception: Gradle task assembleDebug failed with exit code 1