compileJava task Error


(HyeonAh Lee) #1

hello

build.gradle file is below.

apply plugin: ‘war’ apply plugin: ‘tomcat’

buildscript {

repositories {

add(new org.apache.ivy.plugins.resolver.URLResolver()) {

name = ‘GitHub Gradle Tomcat Plugin’

addArtifactPattern ‘http://cloud.github.com/downloads/[organisation]/[module]/[module]-[revision].[ext]’

}

}

dependencies {

classpath ‘bmuschko:gradle-tomcat-plugin:0.9.5’

} }

[configurations.runtime, configurations.default]*.exclude(module: ‘commons-logging’)

[compileJava].options.encoding = ‘UTF-8’

repositories {

mavenCentral()

} project.ext[“springVersion”] = ‘3.1.1.RELEASE’ project.ext[“slf4jVersion”] = ‘1.7.2’ dependencies {

providedCompile ‘javax.servlet:servlet-api:2.4@jar’

runtime ‘org.slf4j:jcl-over-slf4j:’+slf4jVersion

runtime ‘org.springframework:spring-aop:’+project.springVersion,

‘org.springframework:spring-asm:’+project.springVersion,

‘org.springframework:spring-beans:’+project.springVersion,

‘org.springframework:spring-context:’+project.springVersion,

‘org.springframework:spring-context-support:’+project.springVersion,

‘org.springframework:spring-core:’+project.springVersion,

‘org.springframework:spring-expression:’+project.springVersion,

‘org.springframework:spring-jdbc:’+project.springVersion,

‘org.springframework:spring-tx:’+project.springVersion,

‘org.springframework:spring-webmvc:’+project.springVersion,

‘org.mybatis:mybatis:3.1.1’,

‘org.mybatis:mybatis-spring:1.1.1’,

‘mysql:mysql-connector-java:5.1.22’,

‘org.apache.commons:commons-io:1.3.2’,

‘commons-dbcp:commons-dbcp:1.4’,

‘org.aspectj:aspectjlib:1.6.2’,

‘org.aspectj:aspectjweaver:1.7.1’,

‘org.freemarker:freemarker:2.3.19’

compile ‘org.slf4j:slf4j-log4j12:’+project.slf4jVersion

def tomcatVersion = ‘6.0.36’

tomcat “org.apache.tomcat:catalina:${tomcatVersion}”,

“org.apache.tomcat:coyote:${tomcatVersion}”,

“org.apache.tomcat:jasper:${tomcatVersion}”

}

tomcatRun {

httpPort = 8080

URIEncoding = ‘utf-8’

contextPath = ‘/newSpring3’

configFile = file(‘src/main/webapp/newSpring3.xml’) // 기본값 src/main/webapp/META-INF/context.xml }

I wonder why this error occurs… help me…

[sts] ----------------------------------------------------- [sts] Starting Gradle build for the following tasks:

[sts]

:clean [sts]

:compileJava [sts]

:war [sts]

:tomcatRun [sts]

:tomcatRunWar [sts] ----------------------------------------------------- Dynamic properties are deprecated: http://gradle.org/docs/current/dsl/org.gradle.api.plugins.ExtraPropertiesExtension.html Deprecated dynamic property: “springVersion” on “root project ‘newSpring3’”, value: “3.1.1.RELEASE”. Deprecated dynamic property: “slf4jVersion” on “root project ‘newSpring3’”, value: “1.7.2”. :clean :compileJavaD:\workLounge\KR\newSpring3\src\main\java\com\spring3\common\interceptor\AuthInterceptor.java:8: package org.springframework.web.servlet does not exist import org.springframework.web.servlet.ModelAndView;

^ D:\workLounge\KR\newSpring3\src\main\java\com\spring3\common\interceptor\AuthInterceptor.java:9: package org.springframework.web.servlet does not exist import org.springframework.web.servlet.ModelAndViewDefiningException;

^ D:\workLounge\KR\newSpring3\src\main\java\com\spring3\common\interceptor\AuthInterceptor.java:10: package org.springframework.web.servlet.handler does not exist import org.springframework.web.servlet.handler.HandlerInterceptorAdapter;

^ D:\workLounge\KR\newSpring3\src\main\java\com\spring3\common\interceptor\AuthInterceptor.java:14: cannot find symbol symbol: class HandlerInterceptorAdapter public class AuthInterceptor extends HandlerInterceptorAdapter{

^ D:\workLounge\KR\newSpring3\src\main\java\com\spring3\controller\ArticleController.java:8: package org.springframework.stereotype does not exist import org.springframework.stereotype.Controller;

^ D:\workLounge\KR\newSpring3\src\main\java\com\spring3\controller\ArticleController.java:9: package org.springframework.web.bind.annotation does not exist import org.springframework.web.bind.annotation.RequestMapping;

^ D:\workLounge\KR\newSpring3\src\main\java\com\spring3\controller\ArticleController.java:10: package org.springframework.web.servlet does not exist import org.springframework.web.servlet.ModelAndView;

^ D:\workLounge\KR\newSpring3\src\main\java\com\spring3\controller\ArticleController.java:16: cannot find symbol symbol: class Controller @Controller

^ D:\workLounge\KR\newSpring3\src\main\java\com\spring3\controller\ArticleController.java:17: cannot find symbol symbol: class RequestMapping @RequestMapping(value = “article”)

^ D:\workLounge\KR\newSpring3\src\main\java\com\spring3\controller\ArticleController.java:27: cannot find symbol symbol : class ModelAndView location: class com.spring3.controller.ArticleController

public ModelAndView hello(){

^ D:\workLounge\KR\newSpring3\src\main\java\com\spring3\controller\LoginController.java:8: package org.springframework.beans.factory.annotation does not exist import org.springframework.beans.factory.annotation.Autowired;

^ D:\workLounge\KR\newSpring3\src\main\java\com\spring3\controller\LoginController.java:9: package org.springframework.stereotype does not exist import org.springframework.stereotype.Controller;

^ D:\workLounge\KR\newSpring3\src\main\java\com\spring3\controller\LoginController.java:10: package org.springframework.web.bind.annotation does not exist import org.springframework.web.bind.annotation.ExceptionHandler;

^ D:\workLounge\KR\newSpring3\src\main\java\com\spring3\controller\LoginController.java:11: package org.springframework.web.bind.annotation does not exist import org.springframework.web.bind.annotation.ModelAttribute;

^ D:\workLounge\KR\newSpring3\src\main\java\com\spring3\controller\LoginController.java:12: package org.springframework.web.bind.annotation does not exist import org.springframework.web.bind.annotation.RequestMapping;

^ D:\workLounge\KR\newSpring3\src\main\java\com\spring3\controller\LoginController.java:13: package org.springframework.web.bind.annotation does not exist import org.springframework.web.bind.annotation.RequestMethod;

^ D:\workLounge\KR\newSpring3\src\main\java\com\spring3\controller\LoginController.java:14: package org.springframework.web.bind.annotation does not exist import org.springframework.web.bind.annotation.RequestParam;

^ D:\workLounge\KR\newSpring3\src\main\java\com\spring3\controller\LoginController.java:15: package org.springframework.web.bind.annotation does not exist import org.springframework.web.bind.annotation.ResponseBody;

^ D:\workLounge\KR\newSpring3\src\main\java\com\spring3\controller\LoginController.java:16: package org.springframework.web.bind.annotation does not exist import org.springframework.web.bind.annotation.SessionAttributes;

^ D:\workLounge\KR\newSpring3\src\main\java\com\spring3\controller\LoginController.java:17: package org.springframework.web.servlet does not exist import org.springframework.web.servlet.ModelAndView;

^ D:\workLounge\KR\newSpring3\src\main\java\com\spring3\controller\LoginController.java:23: cannot find symbol symbol: class Controller @Controller

^ … 84 errors

FAILED

FAILURE: Build failed with an exception.

  • What went wrong: Execution failed for task ‘:compileJava’. > Compilation failed; see the compiler error output for details.

  • Try: Run with --info or --debug option to get more log output.

  • Exception is: org.gradle.api.tasks.TaskExecutionException: Execution failed for task ‘:compileJava’.

at org.gradle.api.internal.tasks.execution.ExecuteActionsTaskExecuter.executeActions(ExecuteActionsTaskExecuter.java:68)

at org.gradle.api.internal.tasks.execution.ExecuteActionsTaskExecuter.execute(ExecuteActionsTaskExecuter.java:46)

at org.gradle.api.internal.tasks.execution.PostExecutionAnalysisTaskExecuter.execute(PostExecutionAnalysisTaskExecuter.java:34)

at org.gradle.api.internal.changedetection.CacheLockHandlingTaskExecuter$1.run(CacheLockHandlingTaskExecuter.java:34)

at org.gradle.cache.internal.DefaultCacheAccess$3.create(DefaultCacheAccess.java:243)

at org.gradle.cache.internal.DefaultCacheAccess.longRunningOperation(DefaultCacheAccess.java:188)

at org.gradle.cache.internal.DefaultCacheAccess.longRunningOperation(DefaultCacheAccess.java:241)

at org.gradle.cache.internal.DefaultPersistentDirectoryStore.longRunningOperation(DefaultPersistentDirectoryStore.java:137)

at org.gradle.api.internal.changedetection.DefaultTaskArtifactStateCacheAccess.longRunningOperation(DefaultTaskArtifactStateCacheAccess.java:83)

at org.gradle.api.internal.changedetection.CacheLockHandlingTaskExecuter.execute(CacheLockHandlingTaskExecuter.java:32)

at org.gradle.api.internal.tasks.execution.SkipUpToDateTaskExecuter.execute(SkipUpToDateTaskExecuter.java:55)

at org.gradle.api.internal.tasks.execution.ValidatingTaskExecuter.execute(ValidatingTaskExecuter.java:57)

at org.gradle.api.internal.tasks.execution.SkipEmptySourceFilesTaskExecuter.execute(SkipEmptySourceFilesTaskExecuter.java:41)

at org.gradle.api.internal.tasks.execution.SkipTaskWithNoActionsExecuter.execute(SkipTaskWithNoActionsExecuter.java:51)

at org.gradle.api.internal.tasks.execution.SkipOnlyIfTaskExecuter.execute(SkipOnlyIfTaskExecuter.java:52)

at org.gradle.api.internal.tasks.execution.ExecuteAtMostOnceTaskExecuter.execute(ExecuteAtMostOnceTaskExecuter.java:42)

at org.gradle.api.internal.AbstractTask.executeWithoutThrowingTaskFailure(AbstractTask.java:247)

at org.gradle.execution.taskgraph.DefaultTaskPlanExecutor.executeTask(DefaultTaskPlanExecutor.java:52)

at org.gradle.execution.taskgraph.DefaultTaskPlanExecutor.processTask(DefaultTaskPlanExecutor.java:38)

at org.gradle.execution.taskgraph.DefaultTaskPlanExecutor.process(DefaultTaskPlanExecutor.java:30)

at org.gradle.execution.taskgraph.DefaultTaskGraphExecuter.execute(DefaultTaskGraphExecuter.java:83)

at org.gradle.execution.SelectedTaskExecutionAction.execute(SelectedTaskExecutionAction.java:29)

at org.gradle.execution.DefaultBuildExecuter.execute(DefaultBuildExecuter.java:61)

at org.gradle.execution.DefaultBuildExecuter.access$200(DefaultBuildExecuter.java:23)

at org.gradle.execution.DefaultBuildExecuter$2.proceed(DefaultBuildExecuter.java:67)

at org.gradle.api.internal.changedetection.TaskCacheLockHandlingBuildExecuter$1.run(TaskCacheLockHandlingBuildExecuter.java:31)

at org.gradle.cache.internal.DefaultCacheAccess$2.create(DefaultCacheAccess.java:118)

at org.gradle.cache.internal.DefaultCacheAccess.useCache(DefaultCacheAccess.java:133)

at org.gradle.cache.internal.DefaultCacheAccess.useCache(DefaultCacheAccess.java:116)

at org.gradle.cache.internal.DefaultPersistentDirectoryStore.useCache(DefaultPersistentDirectoryStore.java:129)

at org.gradle.api.internal.changedetection.DefaultTaskArtifactStateCacheAccess.useCache(DefaultTaskArtifactStateCacheAccess.java:79)

at org.gradle.api.internal.changedetection.TaskCacheLockHandlingBuildExecuter.execute(TaskCacheLockHandlingBuildExecuter.java:29)

at org.gradle.execution.DefaultBuildExecuter.execute(DefaultBuildExecuter.java:61)

at org.gradle.execution.DefaultBuildExecuter.access$200(DefaultBuildExecuter.java:23)

at org.gradle.execution.DefaultBuildExecuter$2.proceed(DefaultBuildExecuter.java:67)

at org.gradle.execution.DryRunBuildExecutionAction.execute(DryRunBuildExecutionAction.java:32)

at org.gradle.execution.DefaultBuildExecuter.execute(DefaultBuildExecuter.java:61)

at org.gradle.execution.DefaultBuildExecuter.execute(DefaultBuildExecuter.java:54)

at org.gradle.initialization.DefaultGradleLauncher.doBuildStages(DefaultGradleLauncher.java:158)

at org.gradle.initialization.DefaultGradleLauncher.doBuild(DefaultGradleLauncher.java:113)

at org.gradle.initialization.DefaultGradleLauncher.run(DefaultGradleLauncher.java:81)

at org.gradle.tooling.internal.provider.BuildModelAction.run(BuildModelAction.java:63)

at org.gradle.tooling.internal.provider.DelegatingBuildModelAction.run(DelegatingBuildModelAction.java:44)

at org.gradle.tooling.internal.provider.ConfiguringBuildAction.run(ConfiguringBuildAction.java:95)

at org.gradle.launcher.exec.InProcessGradleLauncherActionExecuter.execute(InProcessGradleLauncherActionExecuter.java:39)

at org.gradle.launcher.daemon.server.exec.ExecuteBuild.doBuild(ExecuteBuild.java:45)

at org.gradle.launcher.daemon.server.exec.BuildCommandOnly.execute(BuildCommandOnly.java:34)

at org.gradle.launcher.daemon.server.exec.DaemonCommandExecution.proceed(DaemonCommandExecution.java:126)

at org.gradle.launcher.daemon.server.exec.WatchForDisconnection.execute(WatchForDisconnection.java:42)

at org.gradle.launcher.daemon.server.exec.DaemonCommandExecution.proceed(DaemonCommandExecution.java:126)

at org.gradle.launcher.daemon.server.exec.ResetDeprecationLogger.execute(ResetDeprecationLogger.java:24)

at org.gradle.launcher.daemon.server.exec.DaemonCommandExecution.proceed(DaemonCommandExecution.java:126)

at org.gradle.launcher.daemon.server.exec.StartStopIfBuildAndStop.execute(StartStopIfBuildAndStop.java:33)

at org.gradle.launcher.daemon.server.exec.DaemonCommandExecution.proceed(DaemonCommandExecution.java:126)

at org.gradle.launcher.daemon.server.exec.ReturnResult.execute(ReturnResult.java:34)

at org.gradle.launcher.daemon.server.exec.DaemonCommandExecution.proceed(DaemonCommandExecution.java:126)

at org.gradle.launcher.daemon.server.exec.ForwardClientInput$2.call(ForwardClientInput.java:70)

at org.gradle.launcher.daemon.server.exec.ForwardClientInput$2.call(ForwardClientInput.java:68)

at org.gradle.util.Swapper.swap(Swapper.java:38)

at org.gradle.launcher.daemon.server.exec.ForwardClientInput.execute(ForwardClientInput.java:68)

at org.gradle.launcher.daemon.server.exec.DaemonCommandExecution.proceed(DaemonCommandExecution.java:126)

at org.gradle.launcher.daemon.server.exec.LogToClient.doBuild(LogToClient.java:60)

at org.gradle.launcher.daemon.server.exec.BuildCommandOnly.execute(BuildCommandOnly.java:34)

at org.gradle.launcher.daemon.server.exec.DaemonCommandExecution.proceed(DaemonCommandExecution.java:126)

at org.gradle.launcher.daemon.server.exec.EstablishBuildEnvironment.doBuild(EstablishBuildEnvironment.java:61)

at org.gradle.launcher.daemon.server.exec.BuildCommandOnly.execute(BuildCommandOnly.java:34)

at org.gradle.launcher.daemon.server.exec.DaemonCommandExecution.proceed(DaemonCommandExecution.java:126)

at org.gradle.launcher.daemon.server.exec.StartBuildOrRespondWithBusy$1.run(StartBuildOrRespondWithBusy.java:45)

at org.gradle.launcher.daemon.server.DaemonStateCoordinator.runCommand(DaemonStateCoordinator.java:185)

at org.gradle.launcher.daemon.server.exec.StartBuildOrRespondWithBusy.doBuild(StartBuildOrRespondWithBusy.java:49)

at org.gradle.launcher.daemon.server.exec.BuildCommandOnly.execute(BuildCommandOnly.java:34)

at org.gradle.launcher.daemon.server.exec.DaemonCommandExecution.proceed(DaemonCommandExecution.java:126)

at org.gradle.launcher.daemon.server.exec.HandleStop.execute(HandleStop.java:36)

at org.gradle.launcher.daemon.server.exec.DaemonCommandExecution.proceed(DaemonCommandExecution.java:126)

at org.gradle.launcher.daemon.server.exec.CatchAndForwardDaemonFailure.execute(CatchAndForwardDaemonFailure.java:32)

at org.gradle.launcher.daemon.server.exec.DaemonCommandExecution.proceed(DaemonCommandExecution.java:126)

at org.gradle.launcher.daemon.server.exec.DefaultDaemonCommandExecuter.executeCommand(DefaultDaemonCommandExecuter.java:52)

at org.gradle.launcher.daemon.server.DefaultIncomingConnectionHandler$ConnectionWorker.handleCommand(DefaultIncomingConnectionHandler.java:142)

at org.gradle.launcher.daemon.server.DefaultIncomingConnectionHandler$ConnectionWorker.run(DefaultIncomingConnectionHandler.java:116)

at org.gradle.internal.concurrent.DefaultExecutorFactory$StoppableExecutorImpl$1.run(DefaultExecutorFactory.java:66) Caused by: org.gradle.api.internal.tasks.compile.CompilationFailedException: Compilation failed; see the compiler error output for details.

at org.gradle.api.internal.tasks.compile.jdk6.Jdk6JavaCompiler.execute(Jdk6JavaCompiler.java:42)

at org.gradle.api.internal.tasks.compile.jdk6.Jdk6JavaCompiler.execute(Jdk6JavaCompiler.java:33)

at org.gradle.api.internal.tasks.compile.NormalizingJavaCompiler.delegateAndHandleErrors(NormalizingJavaCompiler.java:95)

at org.gradle.api.internal.tasks.compile.NormalizingJavaCompiler.execute(NormalizingJavaCompiler.java:48)

at org.gradle.api.internal.tasks.compile.NormalizingJavaCompiler.execute(NormalizingJavaCompiler.java:34)

at org.gradle.api.internal.tasks.compile.DelegatingJavaCompiler.execute(DelegatingJavaCompiler.java:29)

at org.gradle.api.internal.tasks.compile.DelegatingJavaCompiler.execute(DelegatingJavaCompiler.java:20)

at org.gradle.api.internal.tasks.compile.IncrementalJavaCompilerSupport.execute(IncrementalJavaCompilerSupport.java:33)

at org.gradle.api.internal.tasks.compile.IncrementalJavaCompilerSupport.execute(IncrementalJavaCompilerSupport.java:23)

at org.gradle.api.tasks.compile.Compile.compile(Compile.java:68)

at org.gradle.api.internal.BeanDynamicObject$MetaClassAdapter.invokeMethod(BeanDynamicObject.java:216)

at org.gradle.api.internal.BeanDynamicObject.invokeMethod(BeanDynamicObject.java:122)

at org.gradle.api.internal.CompositeDynamicObject.invokeMethod(CompositeDynamicObject.java:147)

at org.gradle.api.tasks.compile.JavaCompile_Decorated.invokeMethod(Unknown Source)

at org.gradle.util.ReflectionUtil.invoke(ReflectionUtil.groovy:23)

at org.gradle.api.internal.project.taskfactory.AnnotationProcessingTaskFactory$4.execute(AnnotationProcessingTaskFactory.java:161)

at org.gradle.api.internal.project.taskfactory.AnnotationProcessingTaskFactory$4.execute(AnnotationProcessingTaskFactory.java:156)

at org.gradle.api.internal.AbstractTask$TaskActionWrapper.execute(AbstractTask.java:472)

at org.gradle.api.internal.AbstractTask$TaskActionWrapper.execute(AbstractTask.java:461)

at org.gradle.api.internal.tasks.execution.ExecuteActionsTaskExecuter.executeActions(ExecuteActionsTaskExecuter.java:60)

… 79 more

BUILD FAILED

Total time: 4.066 secs [sts] Build failed org.gradle.tooling.BuildException: Could not execute build using Gradle distribution ‘http://services.gradle.org/distributions/gradle-1.2-bin.zip’.

at org.gradle.tooling.internal.consumer.ResultHandlerAdapter.onFailure(ResultHandlerAdapter.java:53)

at org.gradle.tooling.internal.consumer.async.DefaultAsyncConnection$2.run(DefaultAsyncConnection.java:71)

at org.gradle.internal.concurrent.DefaultExecutorFactory$StoppableExecutorImpl$1.run(DefaultExecutorFactory.java:66)

at java.util.concurrent.ThreadPoolExecutor$Worker.runTask(ThreadPoolExecutor.java:886)

at java.util.concurrent.ThreadPoolExecutor$Worker.run(ThreadPoolExecutor.java:908)

at java.lang.Thread.run(Thread.java:662) Caused by: org.gradle.api.internal.LocationAwareException: Execution failed for task ‘:compileJava’.

at org.gradle.initialization.DefaultExceptionAnalyser.transform(DefaultExceptionAnalyser.java:85)

at org.gradle.initialization.MultipleBuildFailuresExceptionAnalyser.transform(MultipleBuildFailuresExceptionAnalyser.java:47)

at org.gradle.initialization.DefaultGradleLauncher.doBuild(DefaultGradleLauncher.java:115)

at org.gradle.initialization.DefaultGradleLauncher.run(DefaultGradleLauncher.java:81)

at org.gradle.tooling.internal.provider.BuildModelAction.run(BuildModelAction.java:63)

at org.gradle.tooling.internal.provider.DelegatingBuildModelAction.run(DelegatingBuildModelAction.java:44)

at org.gradle.tooling.internal.provider.ConfiguringBuildAction.run(ConfiguringBuildAction.java:95)

at org.gradle.launcher.exec.InProcessGradleLauncherActionExecuter.execute(InProcessGradleLauncherActionExecuter.java:39)

at org.gradle.launcher.daemon.server.exec.ExecuteBuild.doBuild(ExecuteBuild.java:45)

at org.gradle.launcher.daemon.server.exec.BuildCommandOnly.execute(BuildCommandOnly.java:34)

at org.gradle.launcher.daemon.server.exec.DaemonCommandExecution.proceed(DaemonCommandExecution.java:126)

at org.gradle.launcher.daemon.server.exec.WatchForDisconnection.execute(WatchForDisconnection.java:42)

at org.gradle.launcher.daemon.server.exec.DaemonCommandExecution.proceed(DaemonCommandExecution.java:126)

at org.gradle.launcher.daemon.server.exec.ResetDeprecationLogger.execute(ResetDeprecationLogger.java:24)

at org.gradle.launcher.daemon.server.exec.DaemonCommandExecution.proceed(DaemonCommandExecution.java:126)

at org.gradle.launcher.daemon.server.exec.StartStopIfBuildAndStop.execute(StartStopIfBuildAndStop.java:33)

at org.gradle.launcher.daemon.server.exec.DaemonCommandExecution.proceed(DaemonCommandExecution.java:126)

at org.gradle.launcher.daemon.server.exec.ReturnResult.execute(ReturnResult.java:34)

at org.gradle.launcher.daemon.server.exec.DaemonCommandExecution.proceed(DaemonCommandExecution.java:126)

at org.gradle.launcher.daemon.server.exec.ForwardClientInput$2.call(ForwardClientInput.java:70)

at org.gradle.launcher.daemon.server.exec.ForwardClientInput$2.call(ForwardClientInput.java:68)

at org.gradle.util.Swapper.swap(Swapper.java:38)

at org.gradle.launcher.daemon.server.exec.ForwardClientInput.execute(ForwardClientInput.java:68)

at org.gradle.launcher.daemon.server.exec.DaemonCommandExecution.proceed(DaemonCommandExecution.java:126)

at org.gradle.launcher.daemon.server.exec.LogToClient.doBuild(LogToClient.java:60)

at org.gradle.launcher.daemon.server.exec.BuildCommandOnly.execute(BuildCommandOnly.java:34)

at org.gradle.launcher.daemon.server.exec.DaemonCommandExecution.proceed(DaemonCommandExecution.java:126)

at org.gradle.launcher.daemon.server.exec.EstablishBuildEnvironment.doBuild(EstablishBuildEnvironment.java:61)

at org.gradle.launcher.daemon.server.exec.BuildCommandOnly.execute(BuildCommandOnly.java:34)

at org.gradle.launcher.daemon.server.exec.DaemonCommandExecution.proceed(DaemonCommandExecution.java:126)

at org.gradle.launcher.daemon.server.exec.StartBuildOrRespondWithBusy$1.run(StartBuildOrRespondWithBusy.java:45)

at org.gradle.launcher.daemon.server.DaemonStateCoordinator.runCommand(DaemonStateCoordinator.java:185)

at org.gradle.launcher.daemon.server.exec.StartBuildOrRespondWithBusy.doBuild(StartBuildOrRespondWithBusy.java:49)

at org.gradle.launcher.daemon.server.exec.BuildCommandOnly.execute(BuildCommandOnly.java:34)

at org.gradle.launcher.daemon.server.exec.DaemonCommandExecution.proceed(DaemonCommandExecution.java:126)

at org.gradle.launcher.daemon.server.exec.HandleStop.execute(HandleStop.java:36)

at org.gradle.launcher.daemon.server.exec.DaemonCommandExecution.proceed(DaemonCommandExecution.java:126)

at org.gradle.launcher.daemon.server.exec.CatchAndForwardDaemonFailure.execute(CatchAndForwardDaemonFailure.java:32)

at org.gradle.launcher.daemon.server.exec.DaemonCommandExecution.proceed(DaemonCommandExecution.java:126)

at org.gradle.launcher.daemon.server.exec.DefaultDaemonCommandExecuter.executeCommand(DefaultDaemonCommandExecuter.java:52)

at org.gradle.launcher.daemon.server.DefaultIncomingConnectionHandler$ConnectionWorker.handleCommand(DefaultIncomingConnectionHandler.java:142)

at org.gradle.launcher.daemon.server.DefaultIncomingConnectionHandler$ConnectionWorker.run(DefaultIncomingConnectionHandler.java:116)

… 4 more Caused by: org.gradle.api.tasks.TaskExecutionException: Execution failed for task ‘:compileJava’.

at org.gradle.api.internal.tasks.execution.ExecuteActionsTaskExecuter.executeActions(ExecuteActionsTaskExecuter.java:68)

at org.gradle.api.internal.tasks.execution.ExecuteActionsTaskExecuter.execute(ExecuteActionsTaskExecuter.java:46)

at org.gradle.api.internal.tasks.execution.PostExecutionAnalysisTaskExecuter.execute(PostExecutionAnalysisTaskExecuter.java:34)

at org.gradle.api.internal.changedetection.CacheLockHandlingTaskExecuter$1.run(CacheLockHandlingTaskExecuter.java:34)

at org.gradle.cache.internal.DefaultCacheAccess$3.create(DefaultCacheAccess.java:243)

at org.gradle.cache.internal.DefaultCacheAccess.longRunningOperation(DefaultCacheAccess.java:188)

at org.gradle.cache.internal.DefaultCacheAccess.longRunningOperation(DefaultCacheAccess.java:241)

at org.gradle.cache.internal.DefaultPersistentDirectoryStore.longRunningOperation(DefaultPersistentDirectoryStore.java:137)

at org.gradle.api.internal.changedetection.DefaultTaskArtifactStateCacheAccess.longRunningOperation(DefaultTaskArtifactStateCacheAccess.java:83)

at org.gradle.api.internal.changedetection.CacheLockHandlingTaskExecuter.execute(CacheLockHandlingTaskExecuter.java:32)

at org.gradle.api.internal.tasks.execution.SkipUpToDateTaskExecuter.execute(SkipUpToDateTaskExecuter.java:55)

at org.gradle.api.internal.tasks.execution.ValidatingTaskExecuter.execute(ValidatingTaskExecuter.java:57)

at org.gradle.api.internal.tasks.execution.SkipEmptySourceFilesTaskExecuter.execute(SkipEmptySourceFilesTaskExecuter.java:41)

at org.gradle.api.internal.tasks.execution.SkipTaskWithNoActionsExecuter.execute(SkipTaskWithNoActionsExecuter.java:51)

at org.gradle.api.internal.tasks.execution.SkipOnlyIfTaskExecuter.execute(SkipOnlyIfTaskExecuter.java:52)

at org.gradle.api.internal.tasks.execution.ExecuteAtMostOnceTaskExecuter.execute(ExecuteAtMostOnceTaskExecuter.java:42)

at org.gradle.api.internal.AbstractTask.executeWithoutThrowingTaskFailure(AbstractTask.java:247)

at org.gradle.execution.taskgraph.DefaultTaskPlanExecutor.executeTask(DefaultTaskPlanExecutor.java:52)

at org.gradle.execution.taskgraph.DefaultTaskPlanExecutor.processTask(DefaultTaskPlanExecutor.java:38)

at org.gradle.execution.taskgraph.DefaultTaskPlanExecutor.process(DefaultTaskPlanExecutor.java:30)

at org.gradle.execution.taskgraph.DefaultTaskGraphExecuter.execute(DefaultTaskGraphExecuter.java:83)

at org.gradle.execution.SelectedTaskExecutionAction.execute(SelectedTaskExecutionAction.java:29)

at org.gradle.execution.DefaultBuildExecuter.execute(DefaultBuildExecuter.java:61)

at org.gradle.execution.DefaultBuildExecuter.access$200(DefaultBuildExecuter.java:23)

at org.gradle.execution.DefaultBuildExecuter$2.proceed(DefaultBuildExecuter.java:67)

at org.gradle.api.internal.changedetection.TaskCacheLockHandlingBuildExecuter$1.run(TaskCacheLockHandlingBuildExecuter.java:31)

at org.gradle.cache.internal.DefaultCacheAccess$2.create(DefaultCacheAccess.java:118)

at org.gradle.cache.internal.DefaultCacheAccess.useCache(DefaultCacheAccess.java:133)

at org.gradle.cache.internal.DefaultCacheAccess.useCache(DefaultCacheAccess.java:116)

at org.gradle.cache.internal.DefaultPersistentDirectoryStore.useCache(DefaultPersistentDirectoryStore.java:129)

at org.gradle.api.internal.changedetection.DefaultTaskArtifactStateCacheAccess.useCache(DefaultTaskArtifactStateCacheAccess.java:79)

at org.gradle.api.internal.changedetection.TaskCacheLockHandlingBuildExecuter.execute(TaskCacheLockHandlingBuildExecuter.java:29)

at org.gradle.execution.DefaultBuildExecuter.execute(DefaultBuildExecuter.java:61)

at org.gradle.execution.DefaultBuildExecuter.access$200(DefaultBuildExecuter.java:23)

at org.gradle.execution.DefaultBuildExecuter$2.proceed(DefaultBuildExecuter.java:67)

at org.gradle.execution.DryRunBuildExecutionAction.execute(DryRunBuildExecutionAction.java:32)

at org.gradle.execution.DefaultBuildExecuter.execute(DefaultBuildExecuter.java:61)

at org.gradle.execution.DefaultBuildExecuter.execute(DefaultBuildExecuter.java:54)

at org.gradle.initialization.DefaultGradleLauncher.doBuildStages(DefaultGradleLauncher.java:158)

at org.gradle.initialization.DefaultGradleLauncher.doBuild(DefaultGradleLauncher.java:113)

at org.gradle.initialization.DefaultGradleLauncher.run(DefaultGradleLauncher.java:81)

at org.gradle.tooling.internal.provider.BuildModelAction.run(BuildModelAction.java:63)

at org.gradle.tooling.internal.provider.DelegatingBuildModelAction.run(DelegatingBuildModelAction.java:44)

at org.gradle.tooling.internal.provider.ConfiguringBuildAction.run(ConfiguringBuildAction.java:95)

at org.gradle.launcher.exec.InProcessGradleLauncherActionExecuter.execute(InProcessGradleLauncherActionExecuter.java:39)

at org.gradle.launcher.daemon.server.exec.ExecuteBuild.doBuild(ExecuteBuild.java:45)

at org.gradle.launcher.daemon.server.exec.BuildCommandOnly.execute(BuildCommandOnly.java:34)

at org.gradle.launcher.daemon.server.exec.DaemonCommandExecution.proceed(DaemonCommandExecution.java:126)

at org.gradle.launcher.daemon.server.exec.WatchForDisconnection.execute(WatchForDisconnection.java:42)

at org.gradle.launcher.daemon.server.exec.DaemonCommandExecution.proceed(DaemonCommandExecution.java:126)

at org.gradle.launcher.daemon.server.exec.ResetDeprecationLogger.execute(ResetDeprecationLogger.java:24)

at org.gradle.launcher.daemon.server.exec.DaemonCommandExecution.proceed(DaemonCommandExecution.java:126)

at org.gradle.launcher.daemon.server.exec.StartStopIfBuildAndStop.execute(StartStopIfBuildAndStop.java:33)

at org.gradle.launcher.daemon.server.exec.DaemonCommandExecution.proceed(DaemonCommandExecution.java:126)

at org.gradle.launcher.daemon.server.exec.ReturnResult.execute(ReturnResult.java:34)

at org.gradle.launcher.daemon.server.exec.DaemonCommandExecution.proceed(DaemonCommandExecution.java:126)

at org.gradle.launcher.daemon.server.exec.ForwardClientInput$2.call(ForwardClientInput.java:70)

at org.gradle.launcher.daemon.server.exec.ForwardClientInput$2.call(ForwardClientInput.java:68)

at org.gradle.util.Swapper.swap(Swapper.java:38)

at org.gradle.launcher.daemon.server.exec.ForwardClientInput.execute(ForwardClientInput.java:68)

at org.gradle.launcher.daemon.server.exec.DaemonCommandExecution.proceed(DaemonCommandExecution.java:126)

at org.gradle.launcher.daemon.server.exec.LogToClient.doBuild(LogToClient.java:60)

at org.gradle.launcher.daemon.server.exec.BuildCommandOnly.execute(BuildCommandOnly.java:34)

at org.gradle.launcher.daemon.server.exec.DaemonCommandExecution.proceed(DaemonCommandExecution.java:126)

at org.gradle.launcher.daemon.server.exec.EstablishBuildEnvironment.doBuild(EstablishBuildEnvironment.java:61)

at org.gradle.launcher.daemon.server.exec.BuildCommandOnly.execute(BuildCommandOnly.java:34)

at org.gradle.launcher.daemon.server.exec.DaemonCommandExecution.proceed(DaemonCommandExecution.java:126)

at org.gradle.launcher.daemon.server.exec.StartBuildOrRespondWithBusy$1.run(StartBuildOrRespondWithBusy.java:45)

at org.gradle.launcher.daemon.server.DaemonStateCoordinator.runCommand(DaemonStateCoordinator.java:185)

at org.gradle.launcher.daemon.server.exec.StartBuildOrRespondWithBusy.doBuild(StartBuildOrRespondWithBusy.java:49)

at org.gradle.launcher.daemon.server.exec.BuildCommandOnly.execute(BuildCommandOnly.java:34)

at org.gradle.launcher.daemon.server.exec.DaemonCommandExecution.proceed(DaemonCommandExecution.java:126)

at org.gradle.launcher.daemon.server.exec.HandleStop.execute(HandleStop.java:36)

at org.gradle.launcher.daemon.server.exec.DaemonCommandExecution.proceed(DaemonCommandExecution.java:126)

at org.gradle.launcher.daemon.server.exec.CatchAndForwardDaemonFailure.execute(CatchAndForwardDaemonFailure.java:32)

at org.gradle.launcher.daemon.server.exec.DaemonCommandExecution.proceed(DaemonCommandExecution.java:126)

at org.gradle.launcher.daemon.server.exec.DefaultDaemonCommandExecuter.executeCommand(DefaultDaemonCommandExecuter.java:52)

at org.gradle.launcher.daemon.server.DefaultIncomingConnectionHandler$ConnectionWorker.handleCommand(DefaultIncomingConnectionHandler.java:142)

at org.gradle.launcher.daemon.server.DefaultIncom


#2

Looks like some of your dependencies declared as “runtime” should actually be on the “compile” configuration. Try changing “runtime” to “compile” in your dependencies block.


#3

PS Please use < code /> tags to format code in your post. Please use a pastebin service (like GitHub Gist) for posting long stack traces and output.


(Benjamin Muschko) #4

As a side note, please make sure to retrieve the Tomcat plugin from Maven Central. GitHub downloads will soon not be available anymore.