Can't build gradle!


(芝麻谷) #1

After I check out the source code, I follow the guide and build the source code. but the result is this

houjinxin:wsgradle houjinxin$ gradlew build --stacktrace
:buildSrc:compileJava UP-TO-DATE
:buildSrc:compileGroovy UP-TO-DATE
:buildSrc:processResources UP-TO-DATE
:buildSrc:classes UP-TO-DATE
:buildSrc:jar UP-TO-DATE
:buildSrc:assemble UP-TO-DATE
:buildSrc:checkstyleMain UP-TO-DATE
:buildSrc:compileTestJava UP-TO-DATE
:buildSrc:compileTestGroovy UP-TO-DATE
:buildSrc:processTestResources UP-TO-DATE
:buildSrc:testClasses UP-TO-DATE
:buildSrc:checkstyleTest UP-TO-DATE
:buildSrc:codenarcMain UP-TO-DATE
:buildSrc:codenarcTest UP-TO-DATE
:buildSrc:test UP-TO-DATE
:buildSrc:check UP-TO-DATE
:buildSrc:build UP-TO-DATE

FAILURE: Build failed with an exception.

  • Where:
    Script ‘/Users/houjinxin/Documents/wsgradle/gradle/taskProperties.gradle’ line: 2
  • What went wrong:
    A problem occurred configuring project ‘:announce’.

Could not get unknown property ‘org’ for project ‘:announce’ of type org.gradle.api.Project.

  • Try:
    Run with --info or --debug option to get more log output.
  • Exception is:
    org.gradle.api.ProjectConfigurationException: A problem occurred configuring project ‘:announce’.
    at org.gradle.configuration.project.LifecycleProjectEvaluator.addConfigurationFailure(LifecycleProjectEvaluator.java:79)
    at org.gradle.configuration.project.LifecycleProjectEvaluator.notifyAfterEvaluate(LifecycleProjectEvaluator.java:74)
    at org.gradle.configuration.project.LifecycleProjectEvaluator.evaluate(LifecycleProjectEvaluator.java:61)
    at org.gradle.api.internal.project.AbstractProject.evaluate(AbstractProject.java:540)
    at org.gradle.api.internal.project.AbstractProject.evaluate(AbstractProject.java:93)
    at org.gradle.execution.TaskPathProjectEvaluator.configureHierarchy(TaskPathProjectEvaluator.java:47)
    at org.gradle.configuration.DefaultBuildConfigurer.configure(DefaultBuildConfigurer.java:35)
    at org.gradle.initialization.DefaultGradleLauncher$2.run(DefaultGradleLauncher.java:124)
    at org.gradle.internal.Factories$1.create(Factories.java:22)
    at org.gradle.internal.progress.DefaultBuildOperationExecutor.run(DefaultBuildOperationExecutor.java:91)
    at org.gradle.internal.progress.DefaultBuildOperationExecutor.run(DefaultBuildOperationExecutor.java:53)
    at org.gradle.initialization.DefaultGradleLauncher.doBuildStages(DefaultGradleLauncher.java:121)
    at org.gradle.initialization.DefaultGradleLauncher.access$200(DefaultGradleLauncher.java:32)
    at org.gradle.initialization.DefaultGradleLauncher$1.create(DefaultGradleLauncher.java:98)
    at org.gradle.initialization.DefaultGradleLauncher$1.create(DefaultGradleLauncher.java:92)
    at org.gradle.internal.progress.DefaultBuildOperationExecutor.run(DefaultBuildOperationExecutor.java:91)
    at org.gradle.internal.progress.DefaultBuildOperationExecutor.run(DefaultBuildOperationExecutor.java:63)
    at org.gradle.initialization.DefaultGradleLauncher.doBuild(DefaultGradleLauncher.java:92)
    at org.gradle.initialization.DefaultGradleLauncher.run(DefaultGradleLauncher.java:83)
    at org.gradle.launcher.exec.InProcessBuildActionExecuter$DefaultBuildController.run(InProcessBuildActionExecuter.java:99)
    at org.gradle.tooling.internal.provider.ExecuteBuildActionRunner.run(ExecuteBuildActionRunner.java:28)
    at org.gradle.launcher.exec.ChainingBuildActionRunner.run(ChainingBuildActionRunner.java:35)
    at org.gradle.launcher.exec.InProcessBuildActionExecuter.execute(InProcessBuildActionExecuter.java:48)
    at org.gradle.launcher.exec.InProcessBuildActionExecuter.execute(InProcessBuildActionExecuter.java:30)
    at org.gradle.launcher.exec.ContinuousBuildActionExecuter.execute(ContinuousBuildActionExecuter.java:81)
    at org.gradle.launcher.exec.ContinuousBuildActionExecuter.execute(ContinuousBuildActionExecuter.java:46)
    at org.gradle.launcher.exec.DaemonUsageSuggestingBuildActionExecuter.execute(DaemonUsageSuggestingBuildActionExecuter.java:51)
    at org.gradle.launcher.exec.DaemonUsageSuggestingBuildActionExecuter.execute(DaemonUsageSuggestingBuildActionExecuter.java:28)
    at org.gradle.launcher.cli.RunBuildAction.run(RunBuildAction.java:43)
    at org.gradle.internal.Actions$RunnableActionAdapter.execute(Actions.java:173)
    at org.gradle.launcher.cli.CommandLineActionFactory$ParseAndBuildAction.execute(CommandLineActionFactory.java:239)
    at org.gradle.launcher.cli.CommandLineActionFactory$ParseAndBuildAction.execute(CommandLineActionFactory.java:212)
    at org.gradle.launcher.cli.JavaRuntimeValidationAction.execute(JavaRuntimeValidationAction.java:35)
    at org.gradle.launcher.cli.JavaRuntimeValidationAction.execute(JavaRuntimeValidationAction.java:24)
    at org.gradle.launcher.cli.ExceptionReportingAction.execute(ExceptionReportingAction.java:33)
    at org.gradle.launcher.cli.ExceptionReportingAction.execute(ExceptionReportingAction.java:22)
    at org.gradle.launcher.cli.CommandLineActionFactory$WithLogging.execute(CommandLineActionFactory.java:205)
    at org.gradle.launcher.cli.CommandLineActionFactory$WithLogging.execute(CommandLineActionFactory.java:169)
    at org.gradle.launcher.Main.doAction(Main.java:33)
    at org.gradle.launcher.bootstrap.EntryPoint.run(EntryPoint.java:45)
    at org.gradle.launcher.bootstrap.ProcessBootstrap.runNoExit(ProcessBootstrap.java:55)
    at org.gradle.launcher.bootstrap.ProcessBootstrap.run(ProcessBootstrap.java:36)
    at org.gradle.launcher.GradleMain.main(GradleMain.java:23)
    at org.gradle.wrapper.BootstrapMainStarter.start(BootstrapMainStarter.java:31)
    at org.gradle.wrapper.WrapperExecutor.execute(WrapperExecutor.java:108)
    at org.gradle.wrapper.GradleWrapperMain.main(GradleWrapperMain.java:61)
    Caused by: groovy.lang.MissingPropertyException: Could not get unknown property ‘org’ for project ‘:announce’ of type org.gradle.api.Project.
    at org.gradle.internal.metaobject.AbstractDynamicObject.getMissingProperty(AbstractDynamicObject.java:85)
    at org.gradle.internal.metaobject.AbstractDynamicObject.getProperty(AbstractDynamicObject.java:62)
    at org.gradle.groovy.scripts.BasicScript.propertyMissing(BasicScript.java:66)
    at org.gradle.groovy.scripts.Script.getProperty(Script.java:56)
    at taskProperties_moa0k14uqqmy9ygognk4uysl$_run_closure1.doCall(/Users/houjinxin/Documents/wsgradle/gradle/taskProperties.gradle:2)
    at org.gradle.listener.ClosureBackedMethodInvocationDispatch.dispatch(ClosureBackedMethodInvocationDispatch.java:40)
    at org.gradle.listener.ClosureBackedMethodInvocationDispatch.dispatch(ClosureBackedMethodInvocationDispatch.java:25)
    at org.gradle.internal.event.AbstractBroadcastDispatch.dispatch(AbstractBroadcastDispatch.java:44)
    at org.gradle.internal.event.BroadcastDispatch.dispatch(BroadcastDispatch.java:79)
    at org.gradle.internal.event.BroadcastDispatch.dispatch(BroadcastDispatch.java:30)
    at org.gradle.internal.dispatch.ProxyDispatchAdapter$DispatchingInvocationHandler.invoke(ProxyDispatchAdapter.java:93)
    at com.sun.proxy.$Proxy11.afterEvaluate(Unknown Source)
    at org.gradle.configuration.project.LifecycleProjectEvaluator.notifyAfterEvaluate(LifecycleProjectEvaluator.java:67)
    … 44 more

BUILD FAILED

Total time: 15.21 secs
please give me some advice? Thank you!


(Adam Adamaszek) #2

Rule of thumb: you need to use gradle 3.x+ to build gradle 3.x+.