Android Studio - Gradle Build Error

(David Brown) #1

Hi, I’m trying to build my project with the Gradle CLI but keep running into an error. I can build the project fine from Android Studio.

When I run the ./gradlew assemble command, it throws the following error:

Task :app:compileStagingJavaWithJavac FAILED

FAILURE: Build failed with an exception.

  • What went wrong:
    Execution failed for task ‘:app:compileStagingJavaWithJavac’.

javax/xml/bind/JAXBException

Running with --stacktrace shows gives me a ClassNotFoundException, which is probably masking the root error. Any ideas on how to get this to build?

    at org.gradle.internal.execution.impl.DefaultWorkExecutor.execute(DefaultWorkExecutor.java:33)
    at org.gradle.api.internal.tasks.execution.ExecuteActionsTaskExecuter.execute(ExecuteActionsTaskExecuter.java:120)
    ... 126 more

Caused by: java.lang.ClassNotFoundException: javax.xml.bind.JAXBException
… 209 more

(LingoCoder) #2

That reminds me of the times when I’ve run Gradle in a JDK 9+ JVM to build a project declared with a JDK 8- source-/targetCompatibility.

Can you run gradle --version and share the output with us? Please?

Also, search for sourceCompatibility and targetCompatibility in your build.gradle and share what you find with us? Thanks.

(David Brown) #3

Thanks for the response. Here is the version:


Gradle 5.1.1

Build time: 2019-01-10 23:05:02 UTC
Revision: 3c9abb645fb83932c44e8610642393ad62116807

Kotlin DSL: 1.1.1
Kotlin: 1.3.11
Groovy: 2.5.4
Ant: Apache Ant™ version 1.9.13 compiled on July 10 2018
JVM: 12.0.1 (Oracle Corporation 12.0.1+12)
OS: Mac OS X 10.14.4 x86_64

And the compatibility is set to:

compileOptions {
    sourceCompatibility JavaVersion.VERSION_1_8
    targetCompatibility JavaVersion.VERSION_1_8
}

Building without the compileOptions gives me this:

org.gradle.execution.MultipleBuildFailures: Build completed with 1 failures.
at org.gradle.initialization.DefaultGradleLauncher$ExecuteTasks.run(DefaultGradleLauncher.java:386)
at org.gradle.internal.operations.DefaultBuildOperationExecutor$RunnableBuildOperationWorker.execute(DefaultBuildOperationExecutor.java:301)
at org.gradle.internal.operations.DefaultBuildOperationExecutor$RunnableBuildOperationWorker.execute(DefaultBuildOperationExecutor.java:293)
at org.gradle.internal.operations.DefaultBuildOperationExecutor.execute(DefaultBuildOperationExecutor.java:175)
at org.gradle.internal.operations.DefaultBuildOperationExecutor.run(DefaultBuildOperationExecutor.java:91)
at org.gradle.internal.operations.DelegatingBuildOperationExecutor.run(DelegatingBuildOperationExecutor.java:31)
at org.gradle.initialization.DefaultGradleLauncher.runTasks(DefaultGradleLauncher.java:247)
at org.gradle.initialization.DefaultGradleLauncher.doBuildStages(DefaultGradleLauncher.java:159)
at org.gradle.initialization.DefaultGradleLauncher.executeTasks(DefaultGradleLauncher.java:134)
at org.gradle.internal.invocation.GradleBuildController$1.execute(GradleBuildController.java:58)
at org.gradle.internal.invocation.GradleBuildController$1.execute(GradleBuildController.java:55)
at org.gradle.internal.invocation.GradleBuildController$3.create(GradleBuildController.java:82)
at org.gradle.internal.invocation.GradleBuildController$3.create(GradleBuildController.java:75)
at org.gradle.internal.work.DefaultWorkerLeaseService.withLocks(DefaultWorkerLeaseService.java:183)
at org.gradle.internal.work.StopShieldingWorkerLeaseService.withLocks(StopShieldingWorkerLeaseService.java:40)
at org.gradle.internal.invocation.GradleBuildController.doBuild(GradleBuildController.java:75)
at org.gradle.internal.invocation.GradleBuildController.run(GradleBuildController.java:55)
at org.gradle.tooling.internal.provider.runner.BuildModelActionRunner.run(BuildModelActionRunner.java:54)
at org.gradle.launcher.exec.ChainingBuildActionRunner.run(ChainingBuildActionRunner.java:35)
at org.gradle.launcher.exec.ChainingBuildActionRunner.run(ChainingBuildActionRunner.java:35)
at org.gradle.launcher.exec.BuildOutcomeReportingBuildActionRunner.run(BuildOutcomeReportingBuildActionRunner.java:58)
at org.gradle.tooling.internal.provider.ValidatingBuildActionRunner.run(ValidatingBuildActionRunner.java:32)
at org.gradle.launcher.exec.BuildCompletionNotifyingBuildActionRunner.run(BuildCompletionNotifyingBuildActionRunner.java:39)
at org.gradle.launcher.exec.RunAsBuildOperationBuildActionRunner$3.call(RunAsBuildOperationBuildActionRunner.java:49)
at org.gradle.launcher.exec.RunAsBuildOperationBuildActionRunner$3.call(RunAsBuildOperationBuildActionRunner.java:44)
at org.gradle.internal.operations.DefaultBuildOperationExecutor$CallableBuildOperationWorker.execute(DefaultBuildOperationExecutor.java:315)
at org.gradle.internal.operations.DefaultBuildOperationExecutor$CallableBuildOperationWorker.execute(DefaultBuildOperationExecutor.java:305)
at org.gradle.internal.operations.DefaultBuildOperationExecutor.execute(DefaultBuildOperationExecutor.java:175)
at org.gradle.internal.operations.DefaultBuildOperationExecutor.call(DefaultBuildOperationExecutor.java:101)
at org.gradle.internal.operations.DelegatingBuildOperationExecutor.call(DelegatingBuildOperationExecutor.java:36)
at org.gradle.launcher.exec.RunAsBuildOperationBuildActionRunner.run(RunAsBuildOperationBuildActionRunner.java:44)
at org.gradle.launcher.exec.InProcessBuildActionExecuter$1.transform(InProcessBuildActionExecuter.java:49)
at org.gradle.launcher.exec.InProcessBuildActionExecuter$1.transform(InProcessBuildActionExecuter.java:46)
at org.gradle.composite.internal.DefaultRootBuildState.run(DefaultRootBuildState.java:78)
at org.gradle.launcher.exec.InProcessBuildActionExecuter.execute(InProcessBuildActionExecuter.java:46)
at org.gradle.launcher.exec.InProcessBuildActionExecuter.execute(InProcessBuildActionExecuter.java:31)
at org.gradle.launcher.exec.BuildTreeScopeBuildActionExecuter.execute(BuildTreeScopeBuildActionExecuter.java:42)
at org.gradle.launcher.exec.BuildTreeScopeBuildActionExecuter.execute(BuildTreeScopeBuildActionExecuter.java:28)
at org.gradle.tooling.internal.provider.ContinuousBuildActionExecuter.execute(ContinuousBuildActionExecuter.java:78)
at org.gradle.tooling.internal.provider.ContinuousBuildActionExecuter.execute(ContinuousBuildActionExecuter.java:52)
at org.gradle.tooling.internal.provider.SubscribableBuildActionExecuter.execute(SubscribableBuildActionExecuter.java:59)
at org.gradle.tooling.internal.provider.SubscribableBuildActionExecuter.execute(SubscribableBuildActionExecuter.java:36)
at org.gradle.tooling.internal.provider.SessionScopeBuildActionExecuter.execute(SessionScopeBuildActionExecuter.java:68)
at org.gradle.tooling.internal.provider.SessionScopeBuildActionExecuter.execute(SessionScopeBuildActionExecuter.java:38)
at org.gradle.tooling.internal.provider.GradleThreadBuildActionExecuter.execute(GradleThreadBuildActionExecuter.java:37)
at org.gradle.tooling.internal.provider.GradleThreadBuildActionExecuter.execute(GradleThreadBuildActionExecuter.java:26)
at org.gradle.tooling.internal.provider.ParallelismConfigurationBuildActionExecuter.execute(ParallelismConfigurationBuildActionExecuter.java:43)
at org.gradle.tooling.internal.provider.ParallelismConfigurationBuildActionExecuter.execute(ParallelismConfigurationBuildActionExecuter.java:29)
at org.gradle.tooling.internal.provider.StartParamsValidatingActionExecuter.execute(StartParamsValidatingActionExecuter.java:60)
at org.gradle.tooling.internal.provider.StartParamsValidatingActionExecuter.execute(StartParamsValidatingActionExecuter.java:32)
at org.gradle.tooling.internal.provider.SessionFailureReportingActionExecuter.execute(SessionFailureReportingActionExecuter.java:55)
at org.gradle.tooling.internal.provider.SessionFailureReportingActionExecuter.execute(SessionFailureReportingActionExecuter.java:41)
at org.gradle.tooling.internal.provider.SetupLoggingActionExecuter.execute(SetupLoggingActionExecuter.java:48)
at org.gradle.tooling.internal.provider.SetupLoggingActionExecuter.execute(SetupLoggingActionExecuter.java:32)
at org.gradle.launcher.daemon.server.exec.ExecuteBuild.doBuild(ExecuteBuild.java:67)
at org.gradle.launcher.daemon.server.exec.BuildCommandOnly.execute(BuildCommandOnly.java:36)
at org.gradle.launcher.daemon.server.api.DaemonCommandExecution.proceed(DaemonCommandExecution.java:104)
at org.gradle.launcher.daemon.server.exec.WatchForDisconnection.execute(WatchForDisconnection.java:37)
at org.gradle.launcher.daemon.server.api.DaemonCommandExecution.proceed(DaemonCommandExecution.java:104)
at org.gradle.launcher.daemon.server.exec.ResetDeprecationLogger.execute(ResetDeprecationLogger.java:26)
at org.gradle.launcher.daemon.server.api.DaemonCommandExecution.proceed(DaemonCommandExecution.java:104)
at org.gradle.launcher.daemon.server.exec.RequestStopIfSingleUsedDaemon.execute(RequestStopIfSingleUsedDaemon.java:34)
at org.gradle.launcher.daemon.server.api.DaemonCommandExecution.proceed(DaemonCommandExecution.java:104)
at org.gradle.launcher.daemon.server.exec.ForwardClientInput$2.call(ForwardClientInput.java:74)
at org.gradle.launcher.daemon.server.exec.ForwardClientInput$2.call(ForwardClientInput.java:72)
at org.gradle.util.Swapper.swap(Swapper.java:38)
at org.gradle.launcher.daemon.server.exec.ForwardClientInput.execute(ForwardClientInput.java:72)
at org.gradle.launcher.daemon.server.api.DaemonCommandExecution.proceed(DaemonCommandExecution.java:104)
at org.gradle.launcher.daemon.server.exec.LogAndCheckHealth.execute(LogAndCheckHealth.java:55)
at org.gradle.launcher.daemon.server.api.DaemonCommandExecution.proceed(DaemonCommandExecution.java:104)
at org.gradle.launcher.daemon.server.exec.LogToClient.doBuild(LogToClient.java:62)
at org.gradle.launcher.daemon.server.exec.BuildCommandOnly.execute(BuildCommandOnly.java:36)
at org.gradle.launcher.daemon.server.api.DaemonCommandExecution.proceed(DaemonCommandExecution.java:104)
at org.gradle.launcher.daemon.server.exec.EstablishBuildEnvironment.doBuild(EstablishBuildEnvironment.java:81)
at org.gradle.launcher.daemon.server.exec.BuildCommandOnly.execute(BuildCommandOnly.java:36)
at org.gradle.launcher.daemon.server.api.DaemonCommandExecution.proceed(DaemonCommandExecution.java:104)
at org.gradle.launcher.daemon.server.exec.StartBuildOrRespondWithBusy$1.run(StartBuildOrRespondWithBusy.java:50)
at org.gradle.launcher.daemon.server.DaemonStateCoordinator$1.run(DaemonStateCoordinator.java:295)
at org.gradle.internal.concurrent.ExecutorPolicy$CatchAndRecordFailures.onExecute(ExecutorPolicy.java:63)
at org.gradle.internal.concurrent.ManagedExecutorImpl$1.run(ManagedExecutorImpl.java:46)
at java.util.concurrent.ThreadPoolExecutor.runWorker(ThreadPoolExecutor.java:1142)
at java.util.concurrent.ThreadPoolExecutor$Worker.run(ThreadPoolExecutor.java:617)
at org.gradle.internal.concurrent.ThreadFactoryImpl$ManagedThreadRunnable.run(ThreadFactoryImpl.java:55)
at java.lang.Thread.run(Thread.java:745)
Caused by: org.gradle.api.tasks.TaskExecutionException: Execution failed for task ‘:app:mergeExtDexRelease’.
at org.gradle.api.internal.tasks.execution.CatchExceptionTaskExecuter.execute(CatchExceptionTaskExecuter.java:38)
at org.gradle.api.internal.tasks.execution.EventFiringTaskExecuter$1.executeTask(EventFiringTaskExecuter.java:67)
at org.gradle.api.internal.tasks.execution.EventFiringTaskExecuter$1.call(EventFiringTaskExecuter.java:52)
at org.gradle.api.internal.tasks.execution.EventFiringTaskExecuter$1.call(EventFiringTaskExecuter.java:49)
at org.gradle.internal.operations.DefaultBuildOperationExecutor$CallableBuildOperationWorker.execute(DefaultBuildOperationExecutor.java:315)
at org.gradle.internal.operations.DefaultBuildOperationExecutor$CallableBuildOperationWorker.execute(DefaultBuildOperationExecutor.java:305)
at org.gradle.internal.operations.DefaultBuildOperationExecutor.execute(DefaultBuildOperationExecutor.java:175)
at org.gradle.internal.operations.DefaultBuildOperationExecutor.call(DefaultBuildOperationExecutor.java:101)
at org.gradle.internal.operations.DelegatingBuildOperationExecutor.call(DelegatingBuildOperationExecutor.java:36)
at org.gradle.api.internal.tasks.execution.EventFiringTaskExecuter.execute(EventFiringTaskExecuter.java:49)
at org.gradle.execution.plan.LocalTaskNodeExecutor.execute(LocalTaskNodeExecutor.java:43)
at org.gradle.execution.taskgraph.DefaultTaskExecutionGraph$InvokeNodeExecutorsAction.execute(DefaultTaskExecutionGraph.java:355)
at org.gradle.execution.taskgraph.DefaultTaskExecutionGraph$InvokeNodeExecutorsAction.execute(DefaultTaskExecutionGraph.java:343)
at org.gradle.execution.taskgraph.DefaultTaskExecutionGraph$BuildOperationAwareExecutionAction.execute(DefaultTaskExecutionGraph.java:336)
at org.gradle.execution.taskgraph.DefaultTaskExecutionGraph$BuildOperationAwareExecutionAction.execute(DefaultTaskExecutionGraph.java:322)
at org.gradle.execution.plan.DefaultPlanExecutor$ExecutorWorker$1.execute(DefaultPlanExecutor.java:134)
at org.gradle.execution.plan.DefaultPlanExecutor$ExecutorWorker$1.execute(DefaultPlanExecutor.java:129)
at org.gradle.execution.plan.DefaultPlanExecutor$ExecutorWorker.execute(DefaultPlanExecutor.java:202)
at org.gradle.execution.plan.DefaultPlanExecutor$ExecutorWorker.executeNextNode(DefaultPlanExecutor.java:193)
at org.gradle.execution.plan.DefaultPlanExecutor$ExecutorWorker.run(DefaultPlanExecutor.java:129)
… 6 more
Caused by: org.gradle.api.internal.artifacts.ivyservice.DefaultLenientConfiguration$ArtifactResolveException: Could not resolve all files for configuration ‘:app:releaseRuntimeClasspath’.
at org.gradle.api.internal.artifacts.configurations.DefaultConfiguration.rethrowFailure(DefaultConfiguration.java:1175)
at org.gradle.api.internal.artifacts.configurations.DefaultConfiguration.access$2100(DefaultConfiguration.java:135)
at org.gradle.api.internal.artifacts.configurations.DefaultConfiguration$ConfigurationFileCollection.getFiles(DefaultConfiguration.java:1150)
at org.gradle.api.internal.file.AbstractFileCollection.iterator(AbstractFileCollection.java:72)
at org.gradle.api.internal.file.collections.DefaultFileCollectionResolveContext$FileTreeConverter.convertInto(DefaultFileCollectionResolveContext.java:209)
at org.gradle.api.internal.file.collections.DefaultFileCollectionResolveContext.doResolve(DefaultFileCollectionResolveContext.java:114)
at org.gradle.api.internal.file.collections.DefaultFileCollectionResolveContext.resolveAsFileTrees(DefaultFileCollectionResolveContext.java:85)
at org.gradle.api.internal.file.AbstractFileCollection$2.visitContents(AbstractFileCollection.java:171)
at org.gradle.api.internal.file.CompositeFileCollection.getSourceCollections(CompositeFileCollection.java:191)
at org.gradle.api.internal.file.CompositeFileTree.getSourceCollections(CompositeFileTree.java:39)
at org.gradle.api.internal.file.CompositeFileCollection$2.visitContents(CompositeFileCollection.java:150)
at org.gradle.api.internal.file.collections.DefaultFileCollectionResolveContext.resolveNested(DefaultFileCollectionResolveContext.java:144)
at org.gradle.api.internal.file.collections.DefaultFileCollectionResolveContext.doResolve(DefaultFileCollectionResolveContext.java:112)
at org.gradle.api.internal.file.collections.DefaultFileCollectionResolveContext.resolveAsFileCollections(DefaultFileCollectionResolveContext.java:92)
at org.gradle.api.internal.file.collections.DefaultFileCollectionResolveContext$FileCollectionConverter.convertInto(DefaultFileCollectionResolveContext.java:164)
at org.gradle.api.internal.file.collections.DefaultFileCollectionResolveContext.doResolve(DefaultFileCollectionResolveContext.java:109)
at org.gradle.api.internal.file.collections.DefaultFileCollectionResolveContext.resolveAsFileCollections(DefaultFileCollectionResolveContext.java:92)
at org.gradle.api.internal.file.CompositeFileCollection.getSourceCollections(CompositeFileCollection.java:192)
at org.gradle.api.internal.file.CompositeFileCollection.visitLeafCollections(CompositeFileCollection.java:204)
at org.gradle.internal.snapshot.impl.DefaultFileSystemSnapshotter.snapshot(DefaultFileSystemSnapshotter.java:126)
at org.gradle.internal.fingerprint.impl.AbstractFileCollectionFingerprinter.fingerprint(AbstractFileCollectionFingerprinter.java:47)
at org.gradle.internal.fingerprint.impl.AbstractPathOnlyFileCollectionFingerprinter.fingerprint(AbstractPathOnlyFileCollectionFingerprinter.java:36)
at org.gradle.api.internal.changedetection.changes.TaskFingerprintUtil.fingerprintTaskFiles(TaskFingerprintUtil.java:82)
at org.gradle.api.internal.changedetection.state.CacheBackedTaskHistoryRepository.createExecution(CacheBackedTaskHistoryRepository.java:123)
at org.gradle.api.internal.changedetection.state.CacheBackedTaskHistoryRepository.access$100(CacheBackedTaskHistoryRepository.java:46)
at org.gradle.api.internal.changedetection.state.CacheBackedTaskHistoryRepository$1.getBeforeExecutionState(CacheBackedTaskHistoryRepository.java:86)
at org.gradle.api.internal.changedetection.changes.DefaultTaskArtifactStateRepository$TaskArtifactStateImpl.getExecutionStateChanges(DefaultTaskArtifactStateRepository.java:189)
at org.gradle.api.internal.tasks.execution.ExecuteActionsTaskExecuter$TaskExecution.getChangesSincePreviousExecution(ExecuteActionsTaskExecuter.java:182)
at org.gradle.internal.execution.impl.steps.SkipUpToDateStep.execute(SkipUpToDateStep.java:52)
at org.gradle.internal.execution.impl.steps.SkipUpToDateStep.execute(SkipUpToDateStep.java:36)
at org.gradle.internal.execution.impl.DefaultWorkExecutor.execute(DefaultWorkExecutor.java:34)
at org.gradle.api.internal.tasks.execution.ExecuteActionsTaskExecuter.execute(ExecuteActionsTaskExecuter.java:91)
at org.gradle.api.internal.tasks.execution.ResolveTaskOutputCachingStateExecuter.execute(ResolveTaskOutputCachingStateExecuter.java:91)
at org.gradle.api.internal.tasks.execution.ValidatingTaskExecuter.execute(ValidatingTaskExecuter.java:57)
at org.gradle.api.internal.tasks.execution.SkipEmptySourceFilesTaskExecuter.execute(SkipEmptySourceFilesTaskExecuter.java:119)
at org.gradle.api.internal.tasks.execution.ResolvePreviousStateExecuter.execute(ResolvePreviousStateExecuter.java:43)
at org.gradle.api.internal.tasks.execution.CleanupStaleOutputsExecuter.execute(CleanupStaleOutputsExecuter.java:93)
at org.gradle.api.internal.tasks.execution.FinalizePropertiesTaskExecuter.execute(FinalizePropertiesTaskExecuter.java:45)
at org.gradle.api.internal.tasks.execution.ResolveTaskArtifactStateTaskExecuter.execute(ResolveTaskArtifactStateTaskExecuter.java:94)
at org.gradle.api.internal.tasks.execution.SkipTaskWithNoActionsExecuter.execute(SkipTaskWithNoActionsExecuter.java:56)
at org.gradle.api.internal.tasks.execution.SkipOnlyIfTaskExecuter.execute(SkipOnlyIfTaskExecuter.java:55)
at org.gradle.api.internal.tasks.execution.CatchExceptionTaskExecuter.execute(CatchExceptionTaskExecuter.java:36)
… 25 more
Caused by: org.gradle.api.artifacts.transform.ArtifactTransformException: Failed to transform artifact ‘okhttp.jar (com.squareup.okhttp3:okhttp:3.14.0)’ to match attributes {artifactType=android-dex, dexing-is-debuggable=false, dexing-min-sdk=24, org.gradle.usage=java-runtime-jars}
at org.gradle.api.internal.artifacts.transform.TransformingArtifactVisitor.visitArtifact(TransformingArtifactVisitor.java:53)
at org.gradle.api.internal.artifacts.ivyservice.resolveengine.artifact.ArtifactBackedResolvedVariant$SingleArtifactSet.visit(ArtifactBackedResolvedVariant.java:112)
at org.gradle.api.internal.artifacts.transform.TransformCompletion.visit(TransformCompletion.java:42)
at org.gradle.api.internal.artifacts.ivyservice.resolveengine.artifact.CompositeResolvedArtifactSet$CompositeResult.visit(CompositeResolvedArtifactSet.java:83)
at org.gradle.api.internal.artifacts.ivyservice.resolveengine.artifact.ParallelResolveArtifactSet$VisitingSet.visit(ParallelResolveArtifactSet.java:64)
at org.gradle.api.internal.artifacts.ivyservice.DefaultLenientConfiguration.visitArtifacts(DefaultLenientConfiguration.java:256)
at org.gradle.api.internal.artifacts.ivyservice.DefaultLenientConfiguration.access$500(DefaultLenientConfiguration.java:69)
at org.gradle.api.internal.artifacts.ivyservice.DefaultLenientConfiguration$2.run(DefaultLenientConfiguration.java:231)
at org.gradle.internal.operations.DefaultBuildOperationExecutor$RunnableBuildOperationWorker.execute(DefaultBuildOperationExecutor.java:301)
at org.gradle.internal.operations.DefaultBuildOperationExecutor$RunnableBuildOperationWorker.execute(DefaultBuildOperationExecutor.java:293)
at org.gradle.internal.operations.DefaultBuildOperationExecutor.execute(DefaultBuildOperationExecutor.java:175)
at org.gradle.internal.operations.DefaultBuildOperationExecutor.run(DefaultBuildOperationExecutor.java:91)
at org.gradle.internal.operations.DelegatingBuildOperationExecutor.run(DelegatingBuildOperationExecutor.java:31)
at org.gradle.api.internal.artifacts.ivyservice.DefaultLenientConfiguration.visitArtifactsWithBuildOperation(DefaultLenientConfiguration.java:228)
at org.gradle.api.internal.artifacts.ivyservice.DefaultLenientConfiguration.access$200(DefaultLenientConfiguration.java:69)
at org.gradle.api.internal.artifacts.ivyservice.DefaultLenientConfiguration$1.visitArtifacts(DefaultLenientConfiguration.java:133)
at org.gradle.api.internal.artifacts.configurations.DefaultConfiguration$ConfigurationFileCollection.getFiles(DefaultConfiguration.java:1147)
… 64 more
Caused by: org.gradle.internal.execution.ExecutionException: Execution failed for DexingTransform: /Users/dbrown/.gradle/caches/modules-2/files-2.1/com.squareup.okhttp3/okhttp/3.14.0/c3a9efd10f26a802da2c47dbe54a8d4c44a6019f/okhttp-3.14.0.jar.
at org.gradle.internal.execution.impl.steps.CatchExceptionStep.execute(CatchExceptionStep.java:35)
at org.gradle.internal.execution.impl.steps.CreateOutputsStep.execute(CreateOutputsStep.java:50)
at org.gradle.internal.execution.impl.steps.SnapshotOutputStep.execute(SnapshotOutputStep.java:43)
at org.gradle.internal.execution.impl.steps.SnapshotOutputStep.execute(SnapshotOutputStep.java:29)
at org.gradle.internal.execution.impl.steps.CacheStep.executeWithoutCache(CacheStep.java:134)
at org.gradle.internal.execution.impl.steps.CacheStep.lambda$execute$3(CacheStep.java:83)
at java.util.Optional.orElseGet(Optional.java:267)
at org.gradle.internal.execution.impl.steps.CacheStep.execute(CacheStep.java:82)
at org.gradle.internal.execution.impl.steps.CacheStep.execute(CacheStep.java:36)
at org.gradle.internal.execution.impl.steps.PrepareCachingStep.execute(PrepareCachingStep.java:33)
at org.gradle.internal.execution.impl.steps.StoreSnapshotsStep.execute(StoreSnapshotsStep.java:38)
at org.gradle.internal.execution.impl.steps.StoreSnapshotsStep.execute(StoreSnapshotsStep.java:23)
at org.gradle.internal.execution.impl.steps.SkipUpToDateStep.executeBecause(SkipUpToDateStep.java:96)
at org.gradle.internal.execution.impl.steps.SkipUpToDateStep.lambda$execute$1(SkipUpToDateStep.java:91)
at java.util.Optional.orElseGet(Optional.java:267)
at org.gradle.internal.execution.impl.steps.SkipUpToDateStep.execute(SkipUpToDateStep.java:91)
at org.gradle.internal.execution.impl.steps.SkipUpToDateStep.execute(SkipUpToDateStep.java:36)
at org.gradle.internal.execution.impl.DefaultWorkExecutor.execute(DefaultWorkExecutor.java:34)
at org.gradle.api.internal.artifacts.transform.DefaultTransformerInvoker.lambda$invoke$0(DefaultTransformerInvoker.java:131)
at org.gradle.api.internal.artifacts.transform.DefaultTransformerInvoker.fireTransformListeners(DefaultTransformerInvoker.java:179)
at org.gradle.api.internal.artifacts.transform.DefaultTransformerInvoker.lambda$invoke$1(DefaultTransformerInvoker.java:116)
at org.gradle.api.internal.artifacts.transform.ImmutableTransformationWorkspaceProvider.lambda$withWorkspace$0(ImmutableTransformationWorkspaceProvider.java:81)
at org.gradle.cache.internal.LockOnDemandCrossProcessCacheAccess.withFileLock(LockOnDemandCrossProcessCacheAccess.java:90)
at org.gradle.cache.internal.DefaultCacheAccess.withFileLock(DefaultCacheAccess.java:194)
at org.gradle.cache.internal.DefaultPersistentDirectoryStore.withFileLock(DefaultPersistentDirectoryStore.java:170)
at org.gradle.cache.internal.DefaultCacheFactory$ReferenceTrackingCache.withFileLock(DefaultCacheFactory.java:194)
at org.gradle.api.internal.artifacts.transform.ImmutableTransformationWorkspaceProvider.withWorkspace(ImmutableTransformationWorkspaceProvider.java:76)
at org.gradle.api.internal.artifacts.transform.AbstractCachingTransformationWorkspaceProvider.lambda$withWorkspace$0(AbstractCachingTransformationWorkspaceProvider.java:54)
at com.google.common.cache.LocalCache$LocalManualCache$1.load(LocalCache.java:4717)
at com.google.common.cache.LocalCache$LoadingValueReference.loadFuture(LocalCache.java:3444)
at com.google.common.cache.LocalCache$Segment.loadSync(LocalCache.java:2193)
at com.google.common.cache.LocalCache$Segment.lockedGetOrLoad(LocalCache.java:2152)
at com.google.common.cache.LocalCache$Segment.get(LocalCache.java:2042)
at com.google.common.cache.LocalCache.get(LocalCache.java:3850)
at com.google.common.cache.LocalCache$LocalManualCache.get(LocalCache.java:4712)
at org.gradle.api.internal.artifacts.transform.AbstractCachingTransformationWorkspaceProvider.withWorkspace(AbstractCachingTransformationWorkspaceProvider.java:53)
at org.gradle.api.internal.artifacts.transform.DefaultTransformerInvoker.invoke(DefaultTransformerInvoker.java:115)
at org.gradle.api.internal.artifacts.transform.TransformationStep.lambda$transform$1(TransformationStep.java:69)
at java.util.Optional.orElseGet(Optional.java:267)
at org.gradle.api.internal.artifacts.transform.TransformationStep.transform(TransformationStep.java:66)
at org.gradle.api.internal.artifacts.transform.TransformationNode$ChainedTransformationNode$1.transform(TransformationNode.java:176)
at org.gradle.api.internal.artifacts.transform.TransformationNode$ArtifactTransformationStepBuildOperation.call(TransformationNode.java:212)
at org.gradle.api.internal.artifacts.transform.TransformationNode$ArtifactTransformationStepBuildOperation.call(TransformationNode.java:195)
at org.gradle.internal.operations.DefaultBuildOperationExecutor$CallableBuildOperationWorker.execute(DefaultBuildOperationExecutor.java:315)
at org.gradle.internal.operations.DefaultBuildOperationExecutor$CallableBuildOperationWorker.execute(DefaultBuildOperationExecutor.java:305)
at org.gradle.internal.operations.DefaultBuildOperationExecutor.execute(DefaultBuildOperationExecutor.java:175)
at org.gradle.internal.operations.DefaultBuildOperationExecutor.call(DefaultBuildOperationExecutor.java:101)
at org.gradle.internal.operations.DelegatingBuildOperationExecutor.call(DelegatingBuildOperationExecutor.java:36)
at org.gradle.api.internal.artifacts.transform.TransformationNode$ChainedTransformationNode.execute(TransformationNode.java:169)
at org.gradle.api.internal.artifacts.transform.TransformationNodeExecutor.execute(TransformationNodeExecutor.java:37)
… 15 more
Caused by: com.android.builder.dexing.DexArchiveBuilderException: Error while dexing.
The dependency contains Java 8 bytecode. Please enable desugaring by adding the following to build.gradle
android {
compileOptions {
sourceCompatibility 1.8
targetCompatibility 1.8
}
}
See https://developer.android.com/studio/write/java8-support.html for details. Alternatively, increase the minSdkVersion to 26 or above.

at com.android.builder.dexing.D8DexArchiveBuilder.getExceptionToRethrow(D8DexArchiveBuilder.java:124)
at com.android.builder.dexing.D8DexArchiveBuilder.convert(D8DexArchiveBuilder.java:101)
at com.android.build.gradle.internal.dependency.DexingTransform.transform(DexingTransform.kt:56)
at org.gradle.api.internal.artifacts.transform.DefaultTransformer.transform(DefaultTransformer.java:76)
at org.gradle.api.internal.artifacts.transform.DefaultTransformerInvoker$TransformerExecution.execute(DefaultTransformerInvoker.java:248)
at org.gradle.internal.execution.impl.steps.ExecuteStep.execute(ExecuteStep.java:49)
at org.gradle.internal.execution.impl.steps.CancelExecutionStep.execute(CancelExecutionStep.java:34)
at org.gradle.internal.execution.impl.steps.TimeoutStep.executeWithoutTimeout(TimeoutStep.java:69)
at org.gradle.internal.execution.impl.steps.TimeoutStep.execute(TimeoutStep.java:49)
at org.gradle.internal.execution.impl.steps.CatchExceptionStep.execute(CatchExceptionStep.java:33)
... 64 more

Caused by: com.android.tools.r8.CompilationFailedException: Compilation failed to complete
at com.android.tools.r8.utils.ExceptionUtils.withCompilationHandler(ExceptionUtils.java:81)
at com.android.tools.r8.utils.ExceptionUtils.withD8CompilationHandler(ExceptionUtils.java:45)
at com.android.tools.r8.D8.run(D8.java:94)
at com.android.builder.dexing.D8DexArchiveBuilder.convert(D8DexArchiveBuilder.java:99)
… 72 more
Caused by: com.android.tools.r8.utils.AbortException: Error: Invoke-customs are only supported starting with Android O (–min-api 26)
at com.android.tools.r8.utils.Reporter.failIfPendingErrors(Reporter.java:101)
at com.android.tools.r8.utils.Reporter.fatalError(Reporter.java:72)
at com.android.tools.r8.utils.ExceptionUtils.withCompilationHandler(ExceptionUtils.java:66)
… 75 more

(LingoCoder) #4

Thanks. Yeah. There’s your problem.

The simplest solution is to just use JDK 8 to compile from the command line.

If you’re not already using it, I recommend you use sdkman. Then you can just switch between different versions of the JDK really simply.

(David Brown) #5

Awesome. Thank you. That worked

1 Like
(LingoCoder) #6

:sunglasses: :cool: You’re welcome.