# The building process hangs very often

**URL:** https://discuss.gradle.org/t/the-building-process-hangs-very-often/2140
**Category:** Old Forum Archive
**Created:** [January 17, 2013, 12:22pm UTC](https://discuss.gradle.org/t/the-building-process-hangs-very-often/2140 "2013-01-17T12:22:00Z")
**Posts on this page:** 7
**Page:** 1

<div class="post-metadata">

### Author: ![aspack](https://sea1.discourse-cdn.com/gradle/user_avatar/discuss.gradle.org/aspack/32/515_2.png) [@aspack](https://discuss.gradle.org/u/aspack)
#### Post date: [January 17, 2013, 12:22pm UTC](https://discuss.gradle.org/t/the-building-process-hangs-very-often/2140/1 "2013-01-17T12:22:00Z")

</div>

FAILURE: Build failed with an exception.

- What went wrong: Could not resolve all dependencies for configuration ‘:classpath’. \> Could not resolve group:com.mycila.maven-license-plugin, module:maven-license-plugin, version:1.10.b1.

Required by:

:Apktool:unspecified \> nl.javadude.gradle.plugins:license-gradle-plugin:0.5.0

> Could not resolve group:com.mycila, module:parent-pom, version:5.

> Could not HEAD ‘[http://repo1.maven.org/maven2/com/mycila/parent-pom/5/parent-pom-5.pom](http://repo1.maven.org/maven2/com/mycila/parent-pom/5/parent-pom-5.pom)’.

> Connection to [http://repo1.maven.org](http://repo1.maven.org) refused

But If I try to open [http://repo1.maven.org/maven2/com/mycila/parent-pom/5/parent-pom-5.pom](http://repo1.maven.org/maven2/com/mycila/parent-pom/5/parent-pom-5.pom) in browser it’s ok. It happens constantly - about 90% of builds.

---

<div class="post-metadata">

### Author: ![luke\_daley](https://sea1.discourse-cdn.com/gradle/user_avatar/discuss.gradle.org/luke_daley/32/9890_2.png) [@luke\_daley](https://discuss.gradle.org/u/luke_daley)
#### Post date: [January 17, 2013, 2:35pm UTC](https://discuss.gradle.org/t/the-building-process-hangs-very-often/2140/2 "2013-01-17T14:35:00Z")

</div>

Can you please run with -i and provide the output for one of these failing cases.

---

<div class="post-metadata">

### Author: ![aspack](https://sea1.discourse-cdn.com/gradle/user_avatar/discuss.gradle.org/aspack/32/515_2.png) [@aspack](https://discuss.gradle.org/u/aspack)
#### Post date: [January 17, 2013, 3:02pm UTC](https://discuss.gradle.org/t/the-building-process-hangs-very-often/2140/3 "2013-01-17T15:02:00Z")

</div>

:brut.apktool:apktool-lib:compileJava Download [http://repo1.maven.org/maven2/junit/junit/4.10/junit-4.10.pom](http://repo1.maven.org/maven2/junit/junit/4.10/junit-4.10.pom) Download [http://repo1.maven.org/maven2/org/yaml/snakeyaml/1.11/snakeyaml-1.11.pom](http://repo1.maven.org/maven2/org/yaml/snakeyaml/1.11/snakeyaml-1.11.pom) Download [http://repo1.maven.org/maven2/xpp3/xpp3/1.1.4c/xpp3-1.1.4c.pom](http://repo1.maven.org/maven2/xpp3/xpp3/1.1.4c/xpp3-1.1.4c.pom) Download [http://repo1.maven.org/maven2/xmlunit/xmlunit/1.3/xmlunit-1.3.pom](http://repo1.maven.org/maven2/xmlunit/xmlunit/1.3/xmlunit-1.3.pom) Download [http://repo1.maven.org/maven2/com/google/guava/guava/12.0/guava-12.0.pom](http://repo1.maven.org/maven2/com/google/guava/guava/12.0/guava-12.0.pom) Download [http://repo1.maven.org/maven2/com/google/guava/guava-parent/12.0/guava-parent-12.0.pom](http://repo1.maven.org/maven2/com/google/guava/guava-parent/12.0/guava-parent-12.0.pom) Resource missing. [HTTP HEAD: [http://repo1.maven.org/maven2/com/google/guava/guava-parent/12.0/guava-parent-12.0.jar](http://repo1.maven.org/maven2/com/google/guava/guava-parent/12.0/guava-parent-12.0.jar)] Download [http://repo1.maven.org/maven2/org/apache/commons/commons-lang3/3.1/commons-lang3-3.1.pom](http://repo1.maven.org/maven2/org/apache/commons/commons-lang3/3.1/commons-lang3-3.1.pom) Download [http://repo1.maven.org/maven2/org/apache/commons/commons-parent/22/commons-parent-22.pom](http://repo1.maven.org/maven2/org/apache/commons/commons-parent/22/commons-parent-22.pom)

FAILURE: Build failed with an exception.

- What went wrong: Could not resolve all dependencies for configuration ‘:brut.apktool:apktool-lib:compile’. \> Could not resolve group:org.apache.commons, module:commons-lang3, version:3.1.

Required by:

Apktool.brut.apktool:apktool-lib:unspecified

> Could not resolve group:org.apache.commons, module:commons-parent, version:22.

> Could not HEAD ‘[http://repo1.maven.org/maven2/org/apache/commons/commons-parent/22/commons-parent-22.jar](http://repo1.maven.org/maven2/org/apache/commons/commons-parent/22/commons-parent-22.jar)’.

> Connection to [http://repo1.maven.org](http://repo1.maven.org) refused

- Try: Run with --stacktrace option to get the stack trace. Run with --debug option to get more log output.

BUILD FAILED

Total time: 1 mins 30.558 secs

---

<div class="post-metadata">

### Author: ![luke\_daley](https://sea1.discourse-cdn.com/gradle/user_avatar/discuss.gradle.org/luke_daley/32/9890_2.png) [@luke\_daley](https://discuss.gradle.org/u/luke_daley)
#### Post date: [January 17, 2013, 3:25pm UTC](https://discuss.gradle.org/t/the-building-process-hangs-very-often/2140/4 "2013-01-17T15:25:00Z")

</div>

That doesn’t look like ‘-i’ output. There should be quite a bit of logging.

---

<div class="post-metadata">

### Author: ![aspack](https://sea1.discourse-cdn.com/gradle/user_avatar/discuss.gradle.org/aspack/32/515_2.png) [@aspack](https://discuss.gradle.org/u/aspack)
#### Post date: [January 17, 2013, 4:21pm UTC](https://discuss.gradle.org/t/the-building-process-hangs-very-often/2140/5 "2013-01-17T16:21:00Z")

</div>

One more:

[http://pastebin.com/zEixJMRc](http://pastebin.com/zEixJMRc)

---

<div class="post-metadata">

### Author: ![luke\_daley](https://sea1.discourse-cdn.com/gradle/user_avatar/discuss.gradle.org/luke_daley/32/9890_2.png) [@luke\_daley](https://discuss.gradle.org/u/luke_daley)
#### Post date: [January 17, 2013, 4:37pm UTC](https://discuss.gradle.org/t/the-building-process-hangs-very-often/2140/6 "2013-01-17T16:37:00Z")

</div>

What version of Gradle are you using? I’m seeing some stuff in that log that looks kinda old.

---

<div class="post-metadata">

### Author: ![aspack](https://sea1.discourse-cdn.com/gradle/user_avatar/discuss.gradle.org/aspack/32/515_2.png) [@aspack](https://discuss.gradle.org/u/aspack)
#### Post date: [January 17, 2013, 4:39pm UTC](https://discuss.gradle.org/t/the-building-process-hangs-very-often/2140/7 "2013-01-17T16:39:00Z")

</div>

The latest one - 1.3
