# Not able to access jars through enterprise proxies

**URL:** <https://discuss.gradle.org/t/not-able-to-access-jars-through-enterprise-proxies/29804>\
**Category:** Help/Discuss\
**Created:** [December 10, 2018, 6:47am UTC](https://discuss.gradle.org/t/not-able-to-access-jars-through-enterprise-proxies/29804 "2018-12-10T06:47:32Z")\
**Posts on this page:** 1\
**Page:** 1

<div class="post-metadata">

**Author:** ![cp681290](https://avatars.discourse-cdn.com/v4/letter/c/22d042/32.png) [@cp681290](https://discuss.gradle.org/u/cp681290)\
**Post date:** [December 10, 2018, 6:47am UTC](https://discuss.gradle.org/t/not-able-to-access-jars-through-enterprise-proxies/29804/1 "2018-12-10T06:47:32Z")

</div>

I am unable to build a project in my IDE ( Intellij IDEa) through gradle. I am currently working behind an enterprise proxy .

The error I get is : Could not GET ‘[https://jcenter.bintray.com/org/springframework/boot/spring-boot-gradle-plugin/2.0.5.RELEASE/spring-boot-gradle-plugin-2.0.5.RELEASE.pom](https://jcenter.bintray.com/org/springframework/boot/spring-boot-gradle-plugin/2.0.5.RELEASE/spring-boot-gradle-plugin-2.0.5.RELEASE.pom)’. Received status code 500 from server: Internal Server Error

Stack:

14:31:58.550 [WARN] [org.apache.http.impl.auth.HttpAuthenticator] NEGOTIATE authentication error: No valid credentials provided (Mechanism level: No valid credentials provided (Mechanism level: Failed to find any Kerberos tgt))  
14:31:58.550 [DEBUG] [org.apache.http.impl.auth.HttpAuthenticator] Generating response to an authentication challenge using ntlm scheme  
14:31:58.556 [DEBUG] [org.apache.http.impl.auth.HttpAuthenticator] Authentication succeeded  
14:31:58.556 [DEBUG] [org.apache.http.impl.conn.DefaultManagedHttpClientConnection] http-outgoing-1: Close connection  
14:31:58.557 [DEBUG] [org.apache.http.impl.execchain.MainClientExec] CONNECT refused by proxy: HTTP/1.1 500 Internal Server Error  
14:31:58.557 [DEBUG] [org.apache.http.impl.execchain.MainClientExec] Connection discarded  
14:31:58.557 [DEBUG] [org.apache.http.impl.conn.PoolingHttpClientConnectionManager] Connection released: [id: 1][route: {tls}-\>http://singtelproxy.net.vic:80-\>[https://jcenter.bintray.com:443](https://jcenter.bintray.com:443)][total kept alive: 0; route allocated: 0 of 20; total allocated:  
14:31:58.558 [INFO] [org.gradle.internal.resource.transport.http.HttpClientHelper] Failed to get resource: GET. [HTTP HTTP/1.1 500 Internal Server Error: [https://jcenter.bintray.com/org/springframework/boot/spring-boot-gradle-plugin/2.0.5.RELEASE/spring-b](https://jcenter.bintray.com/org/springframework/boot/spring-boot-gradle-plugin/2.0.5.RELEASE/spring-b)  
14:31:58.558 [DEBUG] [org.gradle.internal.operations.DefaultBuildOperationExecutor] Completing Build operation 'Download [https://jcenter.bintray.com/org/springframework/boot/spring-boot-gradle-plugin/2.0.5.RELEASE/spring-boot-gradle-plugin-2.0.5.RELEASE.p](https://jcenter.bintray.com/org/springframework/boot/spring-boot-gradle-plugin/2.0.5.RELEASE/spring-boot-gradle-plugin-2.0.5.RELEASE.p)  
14:31:58.558 [DEBUG] [org.gradle.internal.operations.DefaultBuildOperationExecutor] Build operation ‘Download [https://jcenter.bintray.com/org/springframework/boot/spring-boot-gradle-plugin/2.0.5.RELEASE/spring-boot-gradle-plugin-2.0.5.RELEASE.pom](https://jcenter.bintray.com/org/springframework/boot/spring-boot-gradle-plugin/2.0.5.RELEASE/spring-boot-gradle-plugin-2.0.5.RELEASE.pom)’ complet  
14:31:58.566 [DEBUG] [org.gradle.api.internal.artifacts.ivyservice.resolveengine.oldresult.TransientConfigurationResultsBuilder] Flushing resolved configuration data in Binary store in C:\Users\CP681290\AppData\Local\Temp\gradle4441335046551164466.bin. Wr  
14:31:58.569 [DEBUG] [org.gradle.internal.operations.DefaultBuildOperationExecutor] Completing Build operation ‘Resolve dependencies of :classpath’  
14:31:58.569 [DEBUG] [org.gradle.internal.operations.DefaultBuildOperationExecutor] Build operation ‘Resolve dependencies of :classpath’ completed  
14:31:58.570 [DEBUG] [org.gradle.internal.operations.DefaultBuildOperationExecutor] Completing Build operation ‘Apply script build.gradle to root project ‘test’’  
14:31:58.570 [DEBUG] [org.gradle.internal.operations.DefaultBuildOperationExecutor] Build operation ‘Apply script build.gradle to root project ‘test’’ completed  
14:31:58.570 [DEBUG] [org.gradle.configuration.project.BuildScriptProcessor] Timing: Running the build script took 4.657 secs  
14:31:58.570 [DEBUG] [org.gradle.internal.operations.DefaultBuildOperationExecutor] Build operation ‘Notify afterEvaluate listeners of :’ started  
14:31:58.571 [DEBUG] [org.gradle.internal.operations.DefaultBuildOperationExecutor] Completing Build operation ‘Notify afterEvaluate listeners of :’  
14:31:58.571 [DEBUG] [org.gradle.internal.operations.DefaultBuildOperationExecutor] Build operation ‘Notify afterEvaluate listeners of :’ completed  
14:31:58.571 [DEBUG] [org.gradle.internal.operations.DefaultBuildOperationExecutor] Completing Build operation ‘Configure project :’  
14:31:58.571 [DEBUG] [org.gradle.internal.operations.DefaultBuildOperationExecutor] Build operation ‘Configure project :’ completed  
14:31:58.571 [DEBUG] [org.gradle.internal.operations.DefaultBuildOperationExecutor] Completing Build operation ‘Configure build’  
14:31:58.572 [DEBUG] [org.gradle.internal.operations.DefaultBuildOperationExecutor] Build operation ‘Configure build’ completed

14:31:58.575 [ERROR] [org.gradle.internal.buildevents.BuildExceptionReporter]  
14:31:58.575 [ERROR] [org.gradle.internal.buildevents.BuildExceptionReporter] FAILURE: Build failed with an exception.  
14:31:58.575 [ERROR] [org.gradle.internal.buildevents.BuildExceptionReporter]  
14:31:58.575 [ERROR] [org.gradle.internal.buildevents.BuildExceptionReporter] \* What went wrong:  
14:31:58.575 [ERROR] [org.gradle.internal.buildevents.BuildExceptionReporter] A problem occurred configuring root project ‘test’.  
14:31:58.575 [ERROR] [org.gradle.internal.buildevents.BuildExceptionReporter] \> Could not resolve all artifacts for configuration ‘:classpath’.  
14:31:58.576 [ERROR] [org.gradle.internal.buildevents.BuildExceptionReporter] \> Could not resolve org.springframework.boot:spring-boot-gradle-plugin:2.0.5.RELEASE.  
14:31:58.576 [ERROR] [org.gradle.internal.buildevents.BuildExceptionReporter] Required by:  
14:31:58.576 [ERROR] [org.gradle.internal.buildevents.BuildExceptionReporter] project :  
14:31:58.576 [ERROR] [org.gradle.internal.buildevents.BuildExceptionReporter] \> Could not resolve org.springframework.boot:spring-boot-gradle-plugin:2.0.5.RELEASE.  
14:31:58.576 [ERROR] [org.gradle.internal.buildevents.BuildExceptionReporter] \> Could not get resource ‘[https://jcenter.bintray.com/org/springframework/boot/spring-boot-gradle-plugin/2.0.5.RELEASE/spring-boot-gradle-plugin-2.0.5.RELEASE.pom](https://jcenter.bintray.com/org/springframework/boot/spring-boot-gradle-plugin/2.0.5.RELEASE/spring-boot-gradle-plugin-2.0.5.RELEASE.pom)’.  
14:31:58.576 [ERROR] [org.gradle.internal.buildevents.BuildExceptionReporter] \> Could not GET ‘[https://jcenter.bintray.com/org/springframework/boot/spring-boot-gradle-plugin/2.0.5.RELEASE/spring-boot-gradle-plugin-2.0.5.RELEASE.pom](https://jcenter.bintray.com/org/springframework/boot/spring-boot-gradle-plugin/2.0.5.RELEASE/spring-boot-gradle-plugin-2.0.5.RELEASE.pom)’. Received status code 500 from server: Internal Server Error  
14:31:58.577 [ERROR] [org.gradle.internal.buildevents.BuildExceptionReporter]  
14:31:58.577 [ERROR] [org.gradle.internal.buildevents.BuildExceptionReporter] \* Try:  
14:31:58.577 [ERROR] [org.gradle.internal.buildevents.BuildExceptionReporter] Run with --scan to get full insights.  
14:31:58.577 [ERROR] [org.gradle.internal.buildevents.BuildExceptionReporter]  
14:31:58.577 [ERROR] [org.gradle.internal.buildevents.BuildExceptionReporter] \* Exception is:  
14:31:58.579 [ERROR] [org.gradle.internal.buildevents.BuildExceptionReporter] org.gradle.api.ProjectConfigurationException: A problem occurred configuring root project ‘test’.  
14:31:58.579 [ERROR] [org.gradle.internal.buildevents.BuildExceptionReporter] at org.gradle.configuration.project.LifecycleProjectEvaluator.wrapException(LifecycleProjectEvaluator.java:79)  
14:31:58.580 [ERROR] [org.gradle.internal.buildevents.BuildExceptionReporter] at org.gradle.configuration.project.LifecycleProjectEvaluator.addConfigurationFailure(LifecycleProjectEvaluator.java:73)  
14:31:58.580 [ERROR] [org.gradle.internal.buildevents.BuildExceptionReporter] at org.gradle.configuration.project.LifecycleProjectEvaluator.access$400(LifecycleProjectEvaluator.java:54)  
14:31:58.580 [ERROR] [org.gradle.internal.buildevents.BuildExceptionReporter] at org.gradle.configuration.project.LifecycleProjectEvaluator$EvaluateProject.run(LifecycleProjectEvaluator.java:107)  
14:31:58.580 [ERROR] [org.gradle.internal.buildevents.BuildExceptionReporter] at org.gradle.internal.operations.DefaultBuildOperationExecutor$RunnableBuildOperationWorker.execute(DefaultBuildOperationExecutor.java:300)  
14:31:58.580 [ERROR] [org.gradle.internal.buildevents.BuildExceptionReporter] at org.gradle.internal.operations.DefaultBuildOperationExecutor$RunnableBuildOperationWorker.execute(DefaultBuildOperationExecutor.java:292)  
14:31:58.581 [ERROR] [org.gradle.internal.buildevents.BuildExceptionReporter] at org.gradle.internal.operations.DefaultBuildOperationExecutor.execute(DefaultBuildOperationExecutor.java:174)  
14:31:58.581 [ERROR] [org.gradle.internal.buildevents.BuildExceptionReporter] at org.gradle.internal.operations.DefaultBuildOperationExecutor.run(DefaultBuildOperationExecutor.java:90)  
14:31:58.581 [ERROR] [org.gradle.internal.buildevents.BuildExceptionReporter] at org.gradle.internal.operations.DelegatingBuildOperationExecutor.run(DelegatingBuildOperationExecutor.java:31)  
14:31:58.581 [ERROR] [org.gradle.internal.buildevents.BuildExceptionReporter] at org.gradle.configuration.project.LifecycleProjectEvaluator.evaluate(LifecycleProjectEvaluator.java:68)  
14:31:58.582 [ERROR] [org.gradle.internal.buildevents.BuildExceptionReporter] at org.gradle.api.internal.project.DefaultProject.evaluate(DefaultProject.java:687)  
14:31:58.582 [ERROR] [org.gradle.internal.buildevents.BuildExceptionReporter] at org.gradle.api.internal.project.DefaultProject.evaluate(DefaultProject.java:140)  
14:31:58.582 [ERROR] [org.gradle.internal.buildevents.BuildExceptionReporter] at org.gradle.execution.TaskPathProjectEvaluator.configure(TaskPathProjectEvaluator.java:35)  
14:31:58.582 [ERROR] [org.gradle.internal.buildevents.BuildExceptionReporter] at org.gradle.execution.TaskPathProjectEvaluator.configureHierarchy(TaskPathProjectEvaluator.java:60)  
14:31:58.582 [ERROR] [org.gradle.internal.buildevents.BuildExceptionReporter] at org.gradle.configuration.DefaultBuildConfigurer.configure(DefaultBuildConfigurer.java:41)  
14:31:58.583 [ERROR] [org.gradle.internal.buildevents.BuildExceptionReporter] at org.gradle.initialization.DefaultGradleLauncher$ConfigureBuild.run(DefaultGradleLauncher.java:274)  
14:31:58.583 [ERROR] [org.gradle.internal.buildevents.BuildExceptionReporter] at org.gradle.internal.operations.DefaultBuildOperationExecutor$RunnableBuildOperationWorker.execute(DefaultBuildOperationExecutor.java:300)  
14:31:58.583 [ERROR] [org.gradle.internal.buildevents.BuildExceptionReporter] at org.gradle.internal.operations.DefaultBuildOperationExecutor$RunnableBuildOperationWorker.execute(DefaultBuildOperationExecutor.java:292)  
14:31:58.583 [ERROR] [org.gradle.internal.buildevents.BuildExceptionReporter] at org.gradle.internal.operations.DefaultBuildOperationExecutor.execute(DefaultBuildOperationExecutor.java:174)  
14:31:58.583 [ERROR] [org.gradle.internal.buildevents.BuildExceptionReporter] at org.gradle.internal.operations.DefaultBuildOperationExecutor.run(DefaultBuildOperationExecutor.java:90)  
14:31:58.583 [ERROR] [org.gradle.internal.buildevents.BuildExceptionReporter] at org.gradle.internal.operations.DelegatingBuildOperationExecutor.run(DelegatingBuildOperationExecutor.java:31)  
14:31:58.584 [ERROR] [org.gradle.internal.buildevents.BuildExceptionReporter] at org.gradle.initialization.DefaultGradleLauncher.configureBuild(DefaultGradleLauncher.java:182)  
14:31:58.584 [ERROR] [org.gradle.internal.buildevents.BuildExceptionReporter] at org.gradle.initialization.DefaultGradleLauncher.doBuildStages(DefaultGradleLauncher.java:141)  
14:31:58.584 [ERROR] [org.gradle.internal.buildevents.BuildExceptionReporter] at org.gradle.initialization.DefaultGradleLauncher.executeTasks(DefaultGradleLauncher.java:124)  
14:31:58.584 [ERROR] [org.gradle.internal.buildevents.BuildExceptionReporter] at org.gradle.internal.invocation.GradleBuildController$1.call(GradleBuildController.java:77)  
14:31:58.584 [ERROR] [org.gradle.internal.buildevents.BuildExceptionReporter] at org.gradle.internal.invocation.GradleBuildController$1.call(GradleBuildController.java:74)  
14:31:58.584 [ERROR] [org.gradle.internal.buildevents.BuildExceptionReporter] at org.gradle.internal.work.DefaultWorkerLeaseService.withLocks(DefaultWorkerLeaseService.java:154)  
14:31:58.584 [ERROR] [org.gradle.internal.buildevents.BuildExceptionReporter] at org.gradle.internal.work.StopShieldingWorkerLeaseService.withLocks(StopShieldingWorkerLeaseService.java:38)  
14:31:58.584 [ERROR] [org.gradle.internal.buildevents.BuildExceptionReporter] at org.gradle.internal.invocation.GradleBuildController.doBuild(GradleBuildController.java:96)  
14:31:58.585 [ERROR] [org.gradle.internal.buildevents.BuildExceptionReporter] at org.gradle.internal.invocation.GradleBuildController.run(GradleBuildController.java:74)  
14:31:58.585 [ERROR] [org.gradle.internal.buildevents.BuildExceptionReporter] at org.gradle.tooling.internal.provider.ExecuteBuildActionRunner.run(ExecuteBuildActionRunner.java:28)  
14:31:58.585 [ERROR] [org.gradle.internal.buildevents.BuildExceptionReporter] at org.gradle.launcher.exec.ChainingBuildActionRunner.run(ChainingBuildActionRunner.java:35)  
14:31:58.585 [ERROR] [org.gradle.internal.buildevents.BuildExceptionReporter] at org.gradle.tooling.internal.provider.ValidatingBuildActionRunner.run(ValidatingBuildActionRunner.java:32)  
14:31:58.585 [ERROR] [org.gradle.internal.buildevents.BuildExceptionReporter] at org.gradle.launcher.exec.RunAsBuildOperationBuildActionRunner$3.run(RunAsBuildOperationBuildActionRunner.java:50)  
14:31:58.585 [ERROR] [org.gradle.internal.buildevents.BuildExceptionReporter] at org.gradle.internal.operations.DefaultBuildOperationExecutor$RunnableBuildOperationWorker.execute(DefaultBuildOperationExecutor.java:300)  
14:31:58.585 [ERROR] [org.gradle.internal.buildevents.BuildExceptionReporter] at org.gradle.internal.operations.DefaultBuildOperationExecutor$RunnableBuildOperationWorker.execute(DefaultBuildOperationExecutor.java:292)  
14:31:58.586 [ERROR] [org.gradle.internal.buildevents.BuildExceptionReporter] at org.gradle.internal.operations.DefaultBuildOperationExecutor.execute(DefaultBuildOperationExecutor.java:174)  
14:31:58.586 [ERROR] [org.gradle.internal.buildevents.BuildExceptionReporter] at org.gradle.internal.operations.DefaultBuildOperationExecutor.run(DefaultBuildOperationExecutor.java:90)  
14:31:58.586 [ERROR] [org.gradle.internal.buildevents.BuildExceptionReporter] at org.gradle.internal.operations.DelegatingBuildOperationExecutor.run(DelegatingBuildOperationExecutor.java:31)  
14:31:58.586 [ERROR] [org.gradle.internal.buildevents.BuildExceptionReporter] at org.gradle.launcher.exec.RunAsBuildOperationBuildActionRunner.run(RunAsBuildOperationBuildActionRunner.java:45)  
14:31:58.586 [ERROR] [org.gradle.internal.buildevents.BuildExceptionReporter] at org.gradle.tooling.internal.provider.SubscribableBuildActionRunner.run(SubscribableBuildActionRunner.java:51)  
14:31:58.586 [ERROR] [org.gradle.internal.buildevents.BuildExceptionReporter] at org.gradle.launcher.exec.InProcessBuildActionExecuter$1.transform(InProcessBuildActionExecuter.java:47)  
14:31:58.586 [ERROR] [org.gradle.internal.buildevents.BuildExceptionReporter] at org.gradle.launcher.exec.InProcessBuildActionExecuter$1.transform(InProcessBuildActionExecuter.java:44)  
14:31:58.587 [ERROR] [org.gradle.internal.buildevents.BuildExceptionReporter] at org.gradle.composite.internal.DefaultRootBuildState.run(DefaultRootBuildState.java:79)  
14:31:58.587 [ERROR] [org.gradle.internal.buildevents.BuildExceptionReporter] at org.gradle.launcher.exec.InProcessBuildActionExecuter.execute(InProcessBuildActionExecuter.java:44)  
14:31:58.587 [ERROR] [org.gradle.internal.buildevents.BuildExceptionReporter] at org.gradle.launcher.exec.InProcessBuildActionExecuter.execute(InProcessBuildActionExecuter.java:30)  
14:31:58.587 [ERROR] [org.gradle.internal.buildevents.BuildExceptionReporter] at org.gradle.launcher.exec.BuildTreeScopeBuildActionExecuter.execute(BuildTreeScopeBuildActionExecuter.java:39)  
14:31:58.587 [ERROR] [org.gradle.internal.buildevents.BuildExceptionReporter] at org.gradle.launcher.exec.BuildTreeScopeBuildActionExecuter.execute(BuildTreeScopeBuildActionExecuter.java:25)  
14:31:58.588 [ERROR] [org.gradle.internal.buildevents.BuildExceptionReporter] at org.gradle.tooling.internal.provider.ContinuousBuildActionExecuter.execute(ContinuousBuildActionExecuter.java:80)  
14:31:58.588 [ERROR] [org.gradle.internal.buildevents.BuildExceptionReporter] at org.gradle.tooling.internal.provider.ContinuousBuildActionExecuter.execute(ContinuousBuildActionExecuter.java:53)  
14:31:58.588 [ERROR] [org.gradle.internal.buildevents.BuildExceptionReporter] at org.gradle.tooling.internal.provider.ServicesSetupBuildActionExecuter.execute(ServicesSetupBuildActionExecuter.java:62)  
14:31:58.588 [ERROR] [org.gradle.internal.buildevents.BuildExceptionReporter] at org.gradle.tooling.internal.provider.ServicesSetupBuildActionExecuter.execute(ServicesSetupBuildActionExecuter.java:34)  
14:31:58.588 [ERROR] [org.gradle.internal.buildevents.BuildExceptionReporter] at org.gradle.tooling.internal.provider.GradleThreadBuildActionExecuter.execute(GradleThreadBuildActionExecuter.java:36)  
14:31:58.588 [ERROR] [org.gradle.internal.buildevents.BuildExceptionReporter] at org.gradle.tooling.internal.provider.GradleThreadBuildActionExecuter.execute(GradleThreadBuildActionExecuter.java:25)  
14:31:58.588 [ERROR] [org.gradle.internal.buildevents.BuildExceptionReporter] at org.gradle.tooling.internal.provider.ParallelismConfigurationBuildActionExecuter.execute(ParallelismConfigurationBuildActionExecuter.java:43)  
14:31:58.589 [ERROR] [org.gradle.internal.buildevents.BuildExceptionReporter] at org.gradle.tooling.internal.provider.ParallelismConfigurationBuildActionExecuter.execute(ParallelismConfigurationBuildActionExecuter.java:29)  
14:31:58.589 [ERROR] [org.gradle.internal.buildevents.BuildExceptionReporter] at org.gradle.tooling.internal.provider.StartParamsValidatingActionExecuter.execute(StartParamsValidatingActionExecuter.java:59)  
14:31:58.589 [ERROR] [org.gradle.internal.buildevents.BuildExceptionReporter] at org.gradle.tooling.internal.provider.StartParamsValidatingActionExecuter.execute(StartParamsValidatingActionExecuter.java:31)  
14:31:58.589 [ERROR] [org.gradle.internal.buildevents.BuildExceptionReporter] at org.gradle.tooling.internal.provider.SessionFailureReportingActionExecuter.execute(SessionFailureReportingActionExecuter.java:59)  
14:31:58.589 [ERROR] [org.gradle.internal.buildevents.BuildExceptionReporter] at org.gradle.tooling.internal.provider.SessionFailureReportingActionExecuter.execute(SessionFailureReportingActionExecuter.java:44)  
14:31:58.589 [ERROR] [org.gradle.internal.buildevents.BuildExceptionReporter] at org.gradle.tooling.internal.provider.SetupLoggingActionExecuter.execute(SetupLoggingActionExecuter.java:46)  
14:31:58.590 [ERROR] [org.gradle.internal.buildevents.BuildExceptionReporter] at org.gradle.tooling.internal.provider.SetupLoggingActionExecuter.execute(SetupLoggingActionExecuter.java:30)  
14:31:58.590 [ERROR] [org.gradle.internal.buildevents.BuildExceptionReporter] at org.gradle.launcher.daemon.server.exec.ExecuteBuild.doBuild(ExecuteBuild.java:67)  
14:31:58.590 [ERROR] [org.gradle.internal.buildevents.BuildExceptionReporter] at org.gradle.launcher.daemon.server.exec.BuildCommandOnly.execute(BuildCommandOnly.java:36)  
14:31:58.590 [ERROR] [org.gradle.internal.buildevents.BuildExceptionReporter] at org.gradle.launcher.daemon.server.api.DaemonCommandExecution.proceed(DaemonCommandExecution.java:122)  
14:31:58.590 [ERROR] [org.gradle.internal.buildevents.BuildExceptionReporter] at org.gradle.launcher.daemon.server.exec.WatchForDisconnection.execute(WatchForDisconnection.java:37)  
14:31:58.591 [ERROR] [org.gradle.internal.buildevents.BuildExceptionReporter] at org.gradle.launcher.daemon.server.api.DaemonCommandExecution.proceed(DaemonCommandExecution.java:122)  
14:31:58.591 [ERROR] [org.gradle.internal.buildevents.BuildExceptionReporter] at org.gradle.launcher.daemon.server.exec.ResetDeprecationLogger.execute(ResetDeprecationLogger.java:26)  
14:31:58.591 [ERROR] [org.gradle.internal.buildevents.BuildExceptionReporter] at org.gradle.launcher.daemon.server.api.DaemonCommandExecution.proceed(DaemonCommandExecution.java:122)  
14:31:58.591 [ERROR] [org.gradle.internal.buildevents.BuildExceptionReporter] at org.gradle.launcher.daemon.server.exec.RequestStopIfSingleUsedDaemon.execute(RequestStopIfSingleUsedDaemon.java:34)  
14:31:58.591 [ERROR] [org.gradle.internal.buildevents.BuildExceptionReporter] at org.gradle.launcher.daemon.server.api.DaemonCommandExecution.proceed(DaemonCommandExecution.java:122)  
14:31:58.591 [ERROR] [org.gradle.internal.buildevents.BuildExceptionReporter] at org.gradle.launcher.daemon.server.exec.ForwardClientInput$2.call(ForwardClientInput.java:74)  
14:31:58.591 [ERROR] [org.gradle.internal.buildevents.BuildExceptionReporter] at org.gradle.launcher.daemon.server.exec.ForwardClientInput$2.call(ForwardClientInput.java:72)  
14:31:58.592 [ERROR] [org.gradle.internal.buildevents.BuildExceptionReporter] at org.gradle.util.Swapper.swap(Swapper.java:38)  
14:31:58.592 [ERROR] [org.gradle.internal.buildevents.BuildExceptionReporter] at org.gradle.launcher.daemon.server.exec.ForwardClientInput.execute(ForwardClientInput.java:72)  
14:31:58.592 [ERROR] [org.gradle.internal.buildevents.BuildExceptionReporter] at org.gradle.launcher.daemon.server.api.DaemonCommandExecution.proceed(DaemonCommandExecution.java:122)  
14:31:58.592 [ERROR] [org.gradle.internal.buildevents.BuildExceptionReporter] at org.gradle.launcher.daemon.server.exec.LogAndCheckHealth.execute(LogAndCheckHealth.java:55)  
14:31:58.592 [ERROR] [org.gradle.internal.buildevents.BuildExceptionReporter] at org.gradle.launcher.daemon.server.api.DaemonCommandExecution.proceed(DaemonCommandExecution.java:122)  
14:31:58.592 [ERROR] [org.gradle.internal.buildevents.BuildExceptionReporter] at org.gradle.launcher.daemon.server.exec.LogToClient.doBuild(LogToClient.java:62)  
14:31:58.593 [ERROR] [org.gradle.internal.buildevents.BuildExceptionReporter] at org.gradle.launcher.daemon.server.exec.BuildCommandOnly.execute(BuildCommandOnly.java:36)  
14:31:58.593 [ERROR] [org.gradle.internal.buildevents.BuildExceptionReporter] at org.gradle.launcher.daemon.server.api.DaemonCommandExecution.proceed(DaemonCommandExecution.java:122)  
14:31:58.593 [ERROR] [org.gradle.internal.buildevents.BuildExceptionReporter] at org.gradle.launcher.daemon.server.exec.EstablishBuildEnvironment.doBuild(EstablishBuildEnvironment.java:81)

I have configured the gradle.properties in my user folder/.gradle with both http and https settings.

My build.gradle settings are as below for the app I am trying to build.

buildscript {  
repositories {  
jcenter()  
mavenCentral()  
}  
dependencies {  
classpath(“org.springframework.boot:spring-boot-gradle-plugin:2.0.5.RELEASE”)  
}  
}

apply plugin: ‘java’  
apply plugin: ‘idea’  
apply plugin: ‘org.springframework.boot’  
apply plugin: ‘io.spring.dependency-management’

bootJar {  
baseName = ‘gs-spring-boot’  
version = ‘0.1.0’  
}

repositories {  
mavenCentral()  
}

sourceCompatibility = 1.8  
targetCompatibility = 1.8

dependencies {  
compile(“org.springframework.boot:spring-boot-starter-web”)  
testCompile(“junit:junit”)  
}

Please help in debugging the issue.
