# Java issue while running a project on Jenkins

**URL:** <https://discuss.gradle.org/t/java-issue-while-running-a-project-on-jenkins/44032>\
**Category:** Plugin Portal\
**Created:** [October 12, 2022, 12:25pm UTC](https://discuss.gradle.org/t/java-issue-while-running-a-project-on-jenkins/44032 "2022-10-12T12:25:32Z")\
**Posts on this page:** 2\
**Page:** 1

<div class="post-metadata">

**Author:** ![sayawoks](https://avatars.discourse-cdn.com/v4/letter/s/50afbb/32.png) [@sayawoks](https://discuss.gradle.org/u/sayawoks)\
**Post date:** [October 12, 2022, 12:25pm UTC](https://discuss.gradle.org/t/java-issue-while-running-a-project-on-jenkins/44032/1 "2022-10-12T12:25:32Z")

</div>

Running as SYSTEM Building in workspace /Users/mac/.jenkins/workspace/trainSchedule The recommended git tool is: NONE No credentials specified

> git rev-parse --resolve-git-dir /Users/mac/.jenkins/workspace/trainSchedule/.git # timeout=10 Fetching changes from the remote Git repository git config remote.origin.url [GitHub - linuxacademy/cicd-pipeline-train-schedule-jenkins: Train Schedule sample app for Jenkins exercises](https://github.com/linuxacademy/cicd-pipeline-train-schedule-jenkins) # timeout=10 Fetching upstream changes from [GitHub - linuxacademy/cicd-pipeline-train-schedule-jenkins: Train Schedule sample app for Jenkins exercises](https://github.com/linuxacademy/cicd-pipeline-train-schedule-jenkins) git --version # timeout=10 git --version # ‘git version 2.30.1 (Apple Git-130)’ git fetch --tags --force --progress – [GitHub - linuxacademy/cicd-pipeline-train-schedule-jenkins: Train Schedule sample app for Jenkins exercises](https://github.com/linuxacademy/cicd-pipeline-train-schedule-jenkins) +refs/heads/_:refs/remotes/origin/_ # timeout=10 git rev-parse refs/remotes/origin/master^{commit} # timeout=10 Checking out Revision 1603f84d1f50794623c71673920fc3111280045f (refs/remotes/origin/master) git config core.sparsecheckout # timeout=10 git checkout -f 1603f84d1f50794623c71673920fc3111280045f # timeout=10 Commit message: “specify a newer version of node and npm” First time build. Skipping changelog. [Gradle] - Launching build. [trainSchedule] $ /Users/mac/.jenkins/workspace/trainSchedule/gradlew build

FAILURE: Build failed with an exception.

- What went wrong: Could not determine java version from ‘19’.
- Try: Run with --stacktrace option to get the stack trace. Run with --info or --debug option to get more log output. Run with --scan to get full insights.
- Get more help at [https://help.gradle.org](https://help.gradle.org/) Build step ‘Invoke Gradle script’ changed build result to FAILURE Build step ‘Invoke Gradle script’ marked build as failure Archiving artifacts Finished: FAILURE

---

<div class="post-metadata">

**Author:** ![Vampire](https://sea1.discourse-cdn.com/gradle/user_avatar/discuss.gradle.org/vampire/32/9082_2.png) [@Vampire](https://discuss.gradle.org/u/Vampire)\
**Post date:** [October 21, 2022, 12:13pm UTC](https://discuss.gradle.org/t/java-issue-while-running-a-project-on-jenkins/44032/2 "2022-10-21T12:13:16Z")

</div>

You try to run Gradle using Java 19  
[https://docs.gradle.org/current/userguide/compatibility.html](https://docs.gradle.org/current/userguide/compatibility.html)
