# Issue Face while vs code 

**URL:** <https://discuss.gradle.org/t/issue-face-while-vs-code/46004>\
**Category:** Help/Discuss\
**Created:** [July 10, 2023, 2:33pm UTC](https://discuss.gradle.org/t/issue-face-while-vs-code/46004 "2023-07-10T14:33:54Z")\
**Posts on this page:** 1\
**Page:** 1

<div class="post-metadata">

**Author:** ![matif](https://avatars.discourse-cdn.com/v4/letter/m/34f0e0/32.png) [@matif](https://discuss.gradle.org/u/matif)\
**Post date:** [July 10, 2023, 2:33pm UTC](https://discuss.gradle.org/t/issue-face-while-vs-code/46004/1 "2023-07-10T14:33:54Z")

</div>

```plaintext
Launching lib/main.dart on sdk gphone64 x86 64 in debug mode...

FAILURE: Build failed with an exception.
* What went wrong:
Execution failed for task ':app:mapDebugSourceSetPaths'.
> Error while evaluating property 'extraGeneratedResDir' of task ':app:mapDebugSourceSetPaths'
   > Failed to calculate the value of task ':app:mapDebugSourceSetPaths' property 'extraGeneratedResDir'.
      > Querying the mapped value of provider(java.util.Set) before task ':app:processDebugGoogleServices' has completed is not supported

* Try:
> Run with --stacktrace option to get the stack trace.
> Run with --info or --debug option to get more log output.
> Run with --scan to get full insights.

* Get more help at https://help.gradle.org

BUILD FAILED in 50s
Exception: Gradle task assembleDebug failed with exit code 1
Exited

```
