# I am getting an error about com.g00fy2:versioncompare:1.3.4

**URL:** <https://discuss.gradle.org/t/i-am-getting-an-error-about-com-g00fy21-3-4/49366>\
**Category:** Help/Discuss\
**Created:** [September 9, 2024, 12:03pm UTC](https://discuss.gradle.org/t/i-am-getting-an-error-about-com-g00fy21-3-4/49366 "2024-09-09T12:03:29Z")\
**Posts on this page:** 12\
**Page:** 1

<div class="post-metadata">

**Author:** ![sefadogan](https://avatars.discourse-cdn.com/v4/letter/s/e8c25b/32.png) [@sefadogan](https://discuss.gradle.org/u/sefadogan)\
**Post date:** [September 9, 2024, 12:03pm UTC](https://discuss.gradle.org/t/i-am-getting-an-error-about-com-g00fy21-3-4/49366/1 "2024-09-09T12:03:29Z")

</div>

Hello i am sefa,  
I created cordova android 9.1.0 project and then tried download source by gradle. At the end i got an error. How can i fix this?

Here are all the error lines;

```plaintext
Build file 'D:\repos\PlantMonitoringTablet\QualityAndroidProject\platforms\android\app\build.gradle' line: 28

A problem occurred evaluating project ':app'.
> Could not resolve all artifacts for configuration 'classpath'.
   > Could not find com.g00fy2:versioncompare:1.3.4.
     Searched in the following locations:
       - https://jcenter.bintray.com/com/g00fy2/versioncompare/1.3.4/versioncompare-1.3.4.pom
     If the artifact you are trying to retrieve can be found in the repository but without metadata in 'Maven POM' format, you need to adjust the 'metadataSources { ... }' of the repository declaration.
     Required by:
         unspecified:unspecified:unspecified

* Try:
Run with --info or --debug option to get more log output. Run with --scan to get full insights.

* Exception is:
org.gradle.api.GradleScriptException: A problem occurred evaluating project ':app'.
	at org.gradle.groovy.scripts.internal.DefaultScriptRunnerFactory$ScriptRunnerImpl.run(DefaultScriptRunnerFactory.java:93)
	at org.gradle.configuration.DefaultScriptPluginFactory$ScriptPluginImpl.apply(DefaultScriptPluginFactory.java:111)
	at org.gradle.configuration.BuildOperationScriptPlugin$1$1.run(BuildOperationScriptPlugin.java:69)
	at org.gradle.internal.operations.DefaultBuildOperationExecutor$RunnableBuildOperationWorker.execute(DefaultBuildOperationExecutor.java:395)
	at org.gradle.internal.operations.DefaultBuildOperationExecutor$RunnableBuildOperationWorker.execute(DefaultBuildOperationExecutor.java:387)
	at org.gradle.internal.operations.DefaultBuildOperationExecutor$1.execute(DefaultBuildOperationExecutor.java:157)
	at org.gradle.internal.operations.DefaultBuildOperationExecutor.execute(DefaultBuildOperationExecutor.java:242)
	at org.gradle.internal.operations.DefaultBuildOperationExecutor.execute(DefaultBuildOperationExecutor.java:150)
	at org.gradle.internal.operations.DefaultBuildOperationExecutor.run(DefaultBuildOperationExecutor.java:84)
	at org.gradle.internal.operations.DelegatingBuildOperationExecutor.run(DelegatingBuildOperationExecutor.java:31)
	at org.gradle.configuration.BuildOperationScriptPlugin$1.execute(BuildOperationScriptPlugin.java:66)
	at org.gradle.configuration.BuildOperationScriptPlugin$1.execute(BuildOperationScriptPlugin.java:63)
	at org.gradle.configuration.internal.DefaultUserCodeApplicationContext.apply(DefaultUserCodeApplicationContext.java:49)
	at org.gradle.configuration.BuildOperationScriptPlugin.apply(BuildOperationScriptPlugin.java:63)
	at org.gradle.configuration.project.BuildScriptProcessor$1.run(BuildScriptProcessor.java:45)
	at org.gradle.internal.Factories$1.create(Factories.java:26)
	at org.gradle.api.internal.project.DefaultProjectStateRegistry$ProjectStateImpl.withMutableState(DefaultProjectStateRegistry.java:245)
	at org.gradle.api.internal.project.DefaultProjectStateRegistry$ProjectStateImpl.withMutableState(DefaultProjectStateRegistry.java:226)
	at org.gradle.configuration.project.BuildScriptProcessor.execute(BuildScriptProcessor.java:42)
	at org.gradle.configuration.project.BuildScriptProcessor.execute(BuildScriptProcessor.java:26)
	at org.gradle.configuration.project.ConfigureActionsProjectEvaluator.evaluate(ConfigureActionsProjectEvaluator.java:35)
	at org.gradle.configuration.project.LifecycleProjectEvaluator$EvaluateProject$1.run(LifecycleProjectEvaluator.java:102)
	at org.gradle.internal.Factories$1.create(Factories.java:26)
	at org.gradle.internal.work.DefaultWorkerLeaseService.withLocks(DefaultWorkerLeaseService.java:180)
	at org.gradle.internal.work.StopShieldingWorkerLeaseService.withLocks(StopShieldingWorkerLeaseService.java:40)
	at org.gradle.api.internal.project.DefaultProjectStateRegistry$ProjectStateImpl.withProjectLock(DefaultProjectStateRegistry.java:271)
	at org.gradle.api.internal.project.DefaultProjectStateRegistry$ProjectStateImpl.withMutableState(DefaultProjectStateRegistry.java:265)
	at org.gradle.api.internal.project.DefaultProjectStateRegistry$ProjectStateImpl.withMutableState(DefaultProjectStateRegistry.java:226)
	at org.gradle.configuration.project.LifecycleProjectEvaluator$EvaluateProject.run(LifecycleProjectEvaluator.java:91)
	at org.gradle.internal.operations.DefaultBuildOperationExecutor$RunnableBuildOperationWorker.execute(DefaultBuildOperationExecutor.java:395)
	at org.gradle.internal.operations.DefaultBuildOperationExecutor$RunnableBuildOperationWorker.execute(DefaultBuildOperationExecutor.java:387)
	at org.gradle.internal.operations.DefaultBuildOperationExecutor$1.execute(DefaultBuildOperationExecutor.java:157)
	at org.gradle.internal.operations.DefaultBuildOperationExecutor.execute(DefaultBuildOperationExecutor.java:242)
	at org.gradle.internal.operations.DefaultBuildOperationExecutor.execute(DefaultBuildOperationExecutor.java:150)
	at org.gradle.internal.operations.DefaultBuildOperationExecutor.run(DefaultBuildOperationExecutor.java:84)
	at org.gradle.internal.operations.DelegatingBuildOperationExecutor.run(DelegatingBuildOperationExecutor.java:31)
	at org.gradle.configuration.project.LifecycleProjectEvaluator.evaluate(LifecycleProjectEvaluator.java:63)
	at org.gradle.api.internal.project.DefaultProject.evaluate(DefaultProject.java:710)
	at org.gradle.api.internal.project.DefaultProject.evaluate(DefaultProject.java:145)
	at org.gradle.execution.TaskPathProjectEvaluator.configure(TaskPathProjectEvaluator.java:36)
	at org.gradle.execution.TaskPathProjectEvaluator.configureHierarchy(TaskPathProjectEvaluator.java:64)
	at org.gradle.configuration.DefaultProjectsPreparer.prepareProjects(DefaultProjectsPreparer.java:61)
	at org.gradle.configuration.BuildOperatingFiringProjectsPreparer$ConfigureBuild.run(BuildOperatingFiringProjectsPreparer.java:52)
	at org.gradle.internal.operations.DefaultBuildOperationExecutor$RunnableBuildOperationWorker.execute(DefaultBuildOperationExecutor.java:395)
	at org.gradle.internal.operations.DefaultBuildOperationExecutor$RunnableBuildOperationWorker.execute(DefaultBuildOperationExecutor.java:387)
	at org.gradle.internal.operations.DefaultBuildOperationExecutor$1.execute(DefaultBuildOperationExecutor.java:157)
	at org.gradle.internal.operations.DefaultBuildOperationExecutor.execute(DefaultBuildOperationExecutor.java:242)
	at org.gradle.internal.operations.DefaultBuildOperationExecutor.execute(DefaultBuildOperationExecutor.java:150)
	at org.gradle.internal.operations.DefaultBuildOperationExecutor.run(DefaultBuildOperationExecutor.java:84)
	at org.gradle.internal.operations.DelegatingBuildOperationExecutor.run(DelegatingBuildOperationExecutor.java:31)
	at org.gradle.configuration.BuildOperatingFiringProjectsPreparer.prepareProjects(BuildOperatingFiringProjectsPreparer.java:40)
	at org.gradle.initialization.DefaultGradleLauncher.prepareProjects(DefaultGradleLauncher.java:220)
	at org.gradle.initialization.DefaultGradleLauncher.doClassicBuildStages(DefaultGradleLauncher.java:155)
	at org.gradle.initialization.DefaultGradleLauncher.doBuildStages(DefaultGradleLauncher.java:140)
	at org.gradle.initialization.DefaultGradleLauncher.executeTasks(DefaultGradleLauncher.java:120)
	at org.gradle.internal.invocation.GradleBuildController$1.create(GradleBuildController.java:74)
	at org.gradle.internal.invocation.GradleBuildController$1.create(GradleBuildController.java:67)
	at org.gradle.internal.work.DefaultWorkerLeaseService.withLocks(DefaultWorkerLeaseService.java:180)
	at org.gradle.internal.work.StopShieldingWorkerLeaseService.withLocks(StopShieldingWorkerLeaseService.java:40)
	at org.gradle.internal.invocation.GradleBuildController.doBuild(GradleBuildController.java:67)
	at org.gradle.internal.invocation.GradleBuildController.run(GradleBuildController.java:56)
	at org.gradle.tooling.internal.provider.runner.ClientProvidedPhasedActionRunner.run(ClientProvidedPhasedActionRunner.java:60)
	at org.gradle.launcher.exec.ChainingBuildActionRunner.run(ChainingBuildActionRunner.java:35)
	at org.gradle.launcher.exec.ChainingBuildActionRunner.run(ChainingBuildActionRunner.java:35)
	at org.gradle.launcher.exec.BuildOutcomeReportingBuildActionRunner.run(BuildOutcomeReportingBuildActionRunner.java:63)
	at org.gradle.tooling.internal.provider.ValidatingBuildActionRunner.run(ValidatingBuildActionRunner.java:32)
	at org.gradle.launcher.exec.BuildCompletionNotifyingBuildActionRunner.run(BuildCompletionNotifyingBuildActionRunner.java:39)
	at org.gradle.launcher.exec.RunAsBuildOperationBuildActionRunner$3.call(RunAsBuildOperationBuildActionRunner.java:51)
	at org.gradle.launcher.exec.RunAsBuildOperationBuildActionRunner$3.call(RunAsBuildOperationBuildActionRunner.java:45)
	at org.gradle.internal.operations.DefaultBuildOperationExecutor$CallableBuildOperationWorker.execute(DefaultBuildOperationExecutor.java:409)
	at org.gradle.internal.operations.DefaultBuildOperationExecutor$CallableBuildOperationWorker.execute(DefaultBuildOperationExecutor.java:399)
	at org.gradle.internal.operations.DefaultBuildOperationExecutor$1.execute(DefaultBuildOperationExecutor.java:157)
	at org.gradle.internal.operations.DefaultBuildOperationExecutor.execute(DefaultBuildOperationExecutor.java:242)
	at org.gradle.internal.operations.DefaultBuildOperationExecutor.execute(DefaultBuildOperationExecutor.java:150)
	at org.gradle.internal.operations.DefaultBuildOperationExecutor.call(DefaultBuildOperationExecutor.java:94)
	at org.gradle.internal.operations.DelegatingBuildOperationExecutor.call(DelegatingBuildOperationExecutor.java:36)
	at org.gradle.launcher.exec.RunAsBuildOperationBuildActionRunner.run(RunAsBuildOperationBuildActionRunner.java:45)
	at org.gradle.launcher.exec.InProcessBuildActionExecuter$1.transform(InProcessBuildActionExecuter.java:50)
	at org.gradle.launcher.exec.InProcessBuildActionExecuter$1.transform(InProcessBuildActionExecuter.java:47)
	at org.gradle.composite.internal.DefaultRootBuildState.run(DefaultRootBuildState.java:80)
	at org.gradle.launcher.exec.InProcessBuildActionExecuter.execute(InProcessBuildActionExecuter.java:47)
	at org.gradle.launcher.exec.InProcessBuildActionExecuter.execute(InProcessBuildActionExecuter.java:31)
	at org.gradle.launcher.exec.BuildTreeScopeBuildActionExecuter.execute(BuildTreeScopeBuildActionExecuter.java:42)
	at org.gradle.launcher.exec.BuildTreeScopeBuildActionExecuter.execute(BuildTreeScopeBuildActionExecuter.java:28)
	at org.gradle.tooling.internal.provider.ContinuousBuildActionExecuter.execute(ContinuousBuildActionExecuter.java:87)
	at org.gradle.tooling.internal.provider.ContinuousBuildActionExecuter.execute(ContinuousBuildActionExecuter.java:55)
	at org.gradle.tooling.internal.provider.SubscribableBuildActionExecuter.execute(SubscribableBuildActionExecuter.java:60)
	at org.gradle.tooling.internal.provider.SubscribableBuildActionExecuter.execute(SubscribableBuildActionExecuter.java:38)
	at org.gradle.tooling.internal.provider.SessionScopeBuildActionExecuter.execute(SessionScopeBuildActionExecuter.java:68)
	at org.gradle.tooling.internal.provider.SessionScopeBuildActionExecuter.execute(SessionScopeBuildActionExecuter.java:38)
	at org.gradle.tooling.internal.provider.GradleThreadBuildActionExecuter.execute(GradleThreadBuildActionExecuter.java:37)
	at org.gradle.tooling.internal.provider.GradleThreadBuildActionExecuter.execute(GradleThreadBuildActionExecuter.java:26)
	at org.gradle.tooling.internal.provider.StartParamsValidatingActionExecuter.execute(StartParamsValidatingActionExecuter.java:60)
	at org.gradle.tooling.internal.provider.StartParamsValidatingActionExecuter.execute(StartParamsValidatingActionExecuter.java:32)
	at org.gradle.tooling.internal.provider.SessionFailureReportingActionExecuter.execute(SessionFailureReportingActionExecuter.java:56)
	at org.gradle.tooling.internal.provider.SessionFailureReportingActionExecuter.execute(SessionFailureReportingActionExecuter.java:42)
	at org.gradle.tooling.internal.provider.SetupLoggingActionExecuter.execute(SetupLoggingActionExecuter.java:48)
	at org.gradle.tooling.internal.provider.SetupLoggingActionExecuter.execute(SetupLoggingActionExecuter.java:32)
	at org.gradle.launcher.daemon.server.exec.ExecuteBuild.doBuild(ExecuteBuild.java:68)
	at org.gradle.launcher.daemon.server.exec.BuildCommandOnly.execute(BuildCommandOnly.java:37)
	at org.gradle.launcher.daemon.server.api.DaemonCommandExecution.proceed(DaemonCommandExecution.java:104)
	at org.gradle.launcher.daemon.server.exec.WatchForDisconnection.execute(WatchForDisconnection.java:39)
	at org.gradle.launcher.daemon.server.api.DaemonCommandExecution.proceed(DaemonCommandExecution.java:104)
	at org.gradle.launcher.daemon.server.exec.ResetDeprecationLogger.execute(ResetDeprecationLogger.java:29)
	at org.gradle.launcher.daemon.server.api.DaemonCommandExecution.proceed(DaemonCommandExecution.java:104)
	at org.gradle.launcher.daemon.server.exec.RequestStopIfSingleUsedDaemon.execute(RequestStopIfSingleUsedDaemon.java:35)
	at org.gradle.launcher.daemon.server.api.DaemonCommandExecution.proceed(DaemonCommandExecution.java:104)
	at org.gradle.launcher.daemon.server.exec.ForwardClientInput$2.create(ForwardClientInput.java:78)
	at org.gradle.launcher.daemon.server.exec.ForwardClientInput$2.create(ForwardClientInput.java:75)
	at org.gradle.util.Swapper.swap(Swapper.java:38)
	at org.gradle.launcher.daemon.server.exec.ForwardClientInput.execute(ForwardClientInput.java:75)
	at org.gradle.launcher.daemon.server.api.DaemonCommandExecution.proceed(DaemonCommandExecution.java:104)
	at org.gradle.launcher.daemon.server.exec.LogAndCheckHealth.execute(LogAndCheckHealth.java:55)
	at org.gradle.launcher.daemon.server.api.DaemonCommandExecution.proceed(DaemonCommandExecution.java:104)
	at org.gradle.launcher.daemon.server.exec.LogToClient.doBuild(LogToClient.java:63)
	at org.gradle.launcher.daemon.server.exec.BuildCommandOnly.execute(BuildCommandOnly.java:37)
	at org.gradle.launcher.daemon.server.api.DaemonCommandExecution.proceed(DaemonCommandExecution.java:104)
	at org.gradle.launcher.daemon.server.exec.EstablishBuildEnvironment.doBuild(EstablishBuildEnvironment.java:82)
	at org.gradle.launcher.daemon.server.exec.BuildCommandOnly.execute(BuildCommandOnly.java:37)
	at org.gradle.launcher.daemon.server.api.DaemonCommandExecution.proceed(DaemonCommandExecution.java:104)
	at org.gradle.launcher.daemon.server.exec.StartBuildOrRespondWithBusy$1.run(StartBuildOrRespondWithBusy.java:52)
	at org.gradle.launcher.daemon.server.DaemonStateCoordinator$1.run(DaemonStateCoordinator.java:297)
	at org.gradle.internal.concurrent.ExecutorPolicy$CatchAndRecordFailures.onExecute(ExecutorPolicy.java:64)
	at org.gradle.internal.concurrent.ManagedExecutorImpl$1.run(ManagedExecutorImpl.java:48)
	at org.gradle.internal.concurrent.ThreadFactoryImpl$ManagedThreadRunnable.run(ThreadFactoryImpl.java:56)
Caused by: org.gradle.api.internal.artifacts.ivyservice.DefaultLenientConfiguration$ArtifactResolveException: Could not resolve all artifacts for configuration 'classpath'.
	at org.gradle.api.internal.artifacts.configurations.DefaultConfiguration.rethrowFailure(DefaultConfiguration.java:1268)
	at org.gradle.api.internal.artifacts.configurations.DefaultConfiguration.access$1800(DefaultConfiguration.java:142)
	at org.gradle.api.internal.artifacts.configurations.DefaultConfiguration$ConfigurationArtifactCollection.ensureResolved(DefaultConfiguration.java:1761)
	at org.gradle.api.internal.artifacts.configurations.DefaultConfiguration$ConfigurationArtifactCollection.getArtifacts(DefaultConfiguration.java:1727)
	at org.gradle.composite.internal.CompositeBuildClassPathInitializer.execute(CompositeBuildClassPathInitializer.java:45)
	at org.gradle.composite.internal.CompositeBuildClassPathInitializer.execute(CompositeBuildClassPathInitializer.java:32)
	at org.gradle.api.internal.initialization.DefaultScriptClassPathResolver.resolveClassPath(DefaultScriptClassPathResolver.java:37)
	at org.gradle.api.internal.initialization.DefaultScriptHandler.getScriptClassPath(DefaultScriptHandler.java:87)
	at org.gradle.plugin.use.internal.DefaultPluginRequestApplicator.defineScriptHandlerClassScope(DefaultPluginRequestApplicator.java:157)
	at org.gradle.plugin.use.internal.DefaultPluginRequestApplicator.applyPlugins(DefaultPluginRequestApplicator.java:78)
	at org.gradle.configuration.DefaultScriptPluginFactory$ScriptPluginImpl.apply(DefaultScriptPluginFactory.java:117)
	at org.gradle.configuration.BuildOperationScriptPlugin$1$1.run(BuildOperationScriptPlugin.java:69)
	at org.gradle.internal.operations.DefaultBuildOperationExecutor$RunnableBuildOperationWorker.execute(DefaultBuildOperationExecutor.java:395)
	at org.gradle.internal.operations.DefaultBuildOperationExecutor$RunnableBuildOperationWorker.execute(DefaultBuildOperationExecutor.java:387)
	at org.gradle.internal.operations.DefaultBuildOperationExecutor$1.execute(DefaultBuildOperationExecutor.java:157)
	at org.gradle.internal.operations.DefaultBuildOperationExecutor.execute(DefaultBuildOperationExecutor.java:242)
	at org.gradle.internal.operations.DefaultBuildOperationExecutor.execute(DefaultBuildOperationExecutor.java:150)
	at org.gradle.internal.operations.DefaultBuildOperationExecutor.run(DefaultBuildOperationExecutor.java:84)
	at org.gradle.internal.operations.DelegatingBuildOperationExecutor.run(DelegatingBuildOperationExecutor.java:31)
	at org.gradle.configuration.BuildOperationScriptPlugin$1.execute(BuildOperationScriptPlugin.java:66)
	at org.gradle.configuration.BuildOperationScriptPlugin$1.execute(BuildOperationScriptPlugin.java:63)
	at org.gradle.configuration.internal.DefaultUserCodeApplicationContext.apply(DefaultUserCodeApplicationContext.java:49)
	at org.gradle.configuration.BuildOperationScriptPlugin.apply(BuildOperationScriptPlugin.java:63)
	at org.gradle.api.internal.plugins.DefaultObjectConfigurationAction.applyScript(DefaultObjectConfigurationAction.java:149)
	at org.gradle.api.internal.plugins.DefaultObjectConfigurationAction.access$000(DefaultObjectConfigurationAction.java:42)
	at org.gradle.api.internal.plugins.DefaultObjectConfigurationAction$1.run(DefaultObjectConfigurationAction.java:75)
	at org.gradle.api.internal.plugins.DefaultObjectConfigurationAction.execute(DefaultObjectConfigurationAction.java:183)
	at org.gradle.api.internal.project.AbstractPluginAware.apply(AbstractPluginAware.java:49)
	at org.gradle.api.internal.project.ProjectScript.apply(ProjectScript.java:37)
	at org.gradle.internal.metaobject.BeanDynamicObject$MetaClassAdapter.invokeMethod(BeanDynamicObject.java:484)
	at org.gradle.internal.metaobject.BeanDynamicObject.tryInvokeMethod(BeanDynamicObject.java:196)
	at org.gradle.groovy.scripts.BasicScript$ScriptDynamicObject.tryInvokeMethod(BasicScript.java:130)
	at org.gradle.internal.metaobject.ConfigureDelegate.invokeMethod(ConfigureDelegate.java:77)
	at build_86fqymw99dg1h2afps8in3ik7$_run_closure1.doCall(D:\repos\PlantMonitoringTablet\QualityAndroidProject\platforms\android\app\build.gradle:28)
	at org.gradle.util.ClosureBackedAction.execute(ClosureBackedAction.java:71)
	at org.gradle.util.ConfigureUtil.configureTarget(ConfigureUtil.java:154)
	at org.gradle.util.ConfigureUtil.configure(ConfigureUtil.java:105)
	at org.gradle.api.internal.project.DefaultProject.buildscript(DefaultProject.java:1245)
	at org.gradle.api.internal.project.ProjectScript.buildscript(ProjectScript.java:47)
	at org.gradle.api.Script$buildscript$0.callCurrent(Unknown Source)
	at build_86fqymw99dg1h2afps8in3ik7.run(D:\repos\PlantMonitoringTablet\QualityAndroidProject\platforms\android\app\build.gradle:27)
	at org.gradle.groovy.scripts.internal.DefaultScriptRunnerFactory$ScriptRunnerImpl.run(DefaultScriptRunnerFactory.java:91)
	... 124 more
Caused by: org.gradle.internal.resolve.ModuleVersionNotFoundException: Could not find com.g00fy2:versioncompare:1.3.4.
Searched in the following locations:
  - https://jcenter.bintray.com/com/g00fy2/versioncompare/1.3.4/versioncompare-1.3.4.pom
If the artifact you are trying to retrieve can be found in the repository but without metadata in 'Maven POM' format, you need to adjust the 'metadataSources { ... }' of the repository declaration.
Required by:
    unspecified:unspecified:unspecified

```

---

<div class="post-metadata">

**Author:** ![Vampire](https://sea1.discourse-cdn.com/gradle/user_avatar/discuss.gradle.org/vampire/32/9082_2.png) [@Vampire](https://discuss.gradle.org/u/Vampire)\
**Post date:** [September 11, 2024, 12:58pm UTC](https://discuss.gradle.org/t/i-am-getting-an-error-about-com-g00fy21-3-4/49366/2 "2024-09-11T12:58:11Z")

</div>

Don’t use the greatly outdated version 1.3.4 which is only available on JCenter which is not available anymore but just a redirect to Maven Central.

Update the coordinates to the ones used on Maven Central and use a newer version.  
And better replace `jcenter()` by `mavenCentral()` then you save the useless redirects.

---

<div class="post-metadata">

**Author:** ![kontoma](https://avatars.discourse-cdn.com/v4/letter/k/b9e5f3/32.png) [@kontoma](https://discuss.gradle.org/u/kontoma)\
**Post date:** [November 19, 2024, 12:17pm UTC](https://discuss.gradle.org/t/i-am-getting-an-error-about-com-g00fy21-3-4/49366/3 "2024-11-19T12:17:55Z")

</div>

Please i tried the above your comments for error which is happened to me too during Cordova build,  
this the error, please how can fix?

```plaintext
 Where:
Build file 'C:\Users\Kontoma\Desktop\ALL Folder and zip file\alvitruck2\alvitruck\platforms\android\app\build.gradle' line: 28

* What went wrong:
A problem occurred evaluating project ':app'.
> Could not resolve all artifacts for configuration 'classpath'.
   > Could not resolve com.g00fy2:versioncompare:1.3.4.
     Required by:
         unspecified:unspecified:unspecified
      > Could not resolve com.g00fy2:versioncompare:1.3.4.
         > Could not get resource 'https://jcenter.bintray.com/com/g00fy2/versioncompare/1.3.4/versioncompare-1.3.4.pom'.
            > Could not GET 'https://jcenter.bintray.com/com/g00fy2/versioncompare/1.3.4/versioncompare-1.3.4.pom'.
               > jcenter.bintray.com

* Try:
Run with --stacktrace option to get the stack trace. Run with --info or --debug option to get more log output. Run with --scan to get full insights.

* Get more help at https://help.gradle.org

BUILD FAILED in 5s
Command failed with exit code 1: C:\Users\Kontoma\Desktop\ALL Folder and zip file\alvitruck2\alvitruck\platforms\android\gradlew cdvBuildDebug -b C:\Users\Kontoma\Desktop\ALL Folder and zip file\alvitruck2\alvitruck\platforms\android\build.gradle

```

---

<div class="post-metadata">

**Author:** ![Vampire](https://sea1.discourse-cdn.com/gradle/user_avatar/discuss.gradle.org/vampire/32/9082_2.png) [@Vampire](https://discuss.gradle.org/u/Vampire)\
**Post date:** [November 19, 2024, 2:45pm UTC](https://discuss.gradle.org/t/i-am-getting-an-error-about-com-g00fy21-3-4/49366/4 "2024-11-19T14:45:24Z")

</div>

Read my last comment right above your reply. 😉

---

<div class="post-metadata">

**Author:** ![kontoma](https://avatars.discourse-cdn.com/v4/letter/k/b9e5f3/32.png) [@kontoma](https://discuss.gradle.org/u/kontoma)\
**Post date:** [November 20, 2024, 8:41am UTC](https://discuss.gradle.org/t/i-am-getting-an-error-about-com-g00fy21-3-4/49366/5 "2024-11-20T08:41:00Z")

</div>

> [@Vampire](#):
>
> Update the coordinates to the ones used on Maven Central and use a newer version.  
> And better replace `jcenter()` by `mavenCentral()` then you save the useless redirects.

Yes i read and i did but still the error is there i cant build it

---

<div class="post-metadata">

**Author:** ![kontoma](https://avatars.discourse-cdn.com/v4/letter/k/b9e5f3/32.png) [@kontoma](https://discuss.gradle.org/u/kontoma)\
**Post date:** [November 20, 2024, 8:41am UTC](https://discuss.gradle.org/t/i-am-getting-an-error-about-com-g00fy21-3-4/49366/6 "2024-11-20T08:41:37Z")

</div>

Yes i read and i did but still the error is there i cant build it

---

<div class="post-metadata">

**Author:** ![Vampire](https://sea1.discourse-cdn.com/gradle/user_avatar/discuss.gradle.org/vampire/32/9082_2.png) [@Vampire](https://discuss.gradle.org/u/Vampire)\
**Post date:** [November 21, 2024, 2:12am UTC](https://discuss.gradle.org/t/i-am-getting-an-error-about-com-g00fy21-3-4/49366/7 "2024-11-21T02:12:49Z")

</div>

No, if you get the same error, you did **not** do what I said, or you would at least get a different error.

---

<div class="post-metadata">

**Author:** ![lokesh2796](https://avatars.discourse-cdn.com/v4/letter/l/439d5e/32.png) [@lokesh2796](https://discuss.gradle.org/u/lokesh2796)\
**Post date:** [December 4, 2024, 4:56pm UTC](https://discuss.gradle.org/t/i-am-getting-an-error-about-com-g00fy21-3-4/49366/8 "2024-12-04T16:56:50Z")

</div>

Yes you are right. I have changed the jcenter to mavencentral but still there is an issue which is new can anybody please help on this.  
Build file ‘\build.gradle’ line: 28

```plaintext
* What went wrong:
A problem occurred evaluating project ':app'.
> Could not resolve all artifacts for configuration 'classpath'.
   > Could not find com.g00fy2:versioncompare:1.3.4.
     Searched in the following locations:
       - https://repo.maven.apache.org/maven2/com/g00fy2/versioncompare/1.3.4/versioncompare-1.3.4.pom
     If the artifact you are trying to retrieve can be found in the repository but without metadata in 'Maven POM' format, you need to adjust the 'metadataSources { ... }' of the repository declaration.
     Required by:
         unspecified:unspecified:unspecified

* Try:
Run with --stacktrace option to get the stack trace. Run with --info or --debug option to get more log output. Run with --scan to get full insights.

* Get more help at https://help.gradle.org

```

---

<div class="post-metadata">

**Author:** ![Vampire](https://sea1.discourse-cdn.com/gradle/user_avatar/discuss.gradle.org/vampire/32/9082_2.png) [@Vampire](https://discuss.gradle.org/u/Vampire)\
**Post date:** [December 4, 2024, 5:13pm UTC](https://discuss.gradle.org/t/i-am-getting-an-error-about-com-g00fy21-3-4/49366/9 "2024-12-04T17:13:35Z")

</div>

I already told you what to do.  
You only did half of it.  
Why are you asking for help if you constantly ignore the help you are provided.  
Are you a help vampire?

---

<div class="post-metadata">

**Author:** ![Gonself](https://avatars.discourse-cdn.com/v4/letter/g/b77776/32.png) [@Gonself](https://discuss.gradle.org/u/Gonself)\
**Post date:** [January 21, 2025, 4:19pm UTC](https://discuss.gradle.org/t/i-am-getting-an-error-about-com-g00fy21-3-4/49366/10 "2025-01-21T16:19:10Z")

</div>

Hi! I have made the following changes:

- Replaced `jcenter()` with `mavenCentral()`.
- Changed `classpath 'com.g00fy2:versioncompare:1.3.4@jar'` to `classpath 'io.github.g00fy2:versioncompare:1.5.0@jar'`.
- Replaced `import com.g00fy2.versioncompare.Version` with `import io.github.g00fy2.versioncompare.Version`.

But now I have another problem…

> Could not resolve all files for configuration ‘:CordovaLib:classpath’.  
> Could not find com.jfrog.bintray.gradle:gradle-bintray-plugin:1.7.3.  
> Searched in the following locations:  
> - [https://dl.google.com/dl/android/maven2/com/jfrog/bintray/gradle/gradle-bintray-plugin/1.7.3/gradle-bintray-plugin-1.7.3.pom](https://dl.google.com/dl/android/maven2/com/jfrog/bintray/gradle/gradle-bintray-plugin/1.7.3/gradle-bintray-plugin-1.7.3.pom)  
> - [https://repo.maven.apache.org/maven2/com/jfrog/bintray/gradle/gradle-bintray-plugin/1.7.3/gradle-bintray-plugin-1.7.3.pom](https://repo.maven.apache.org/maven2/com/jfrog/bintray/gradle/gradle-bintray-plugin/1.7.3/gradle-bintray-plugin-1.7.3.pom)  
> Required by:  
> project :CordovaLib

Any help?

Thank you very much in advance!

---

<div class="post-metadata">

**Author:** ![Vampire](https://sea1.discourse-cdn.com/gradle/user_avatar/discuss.gradle.org/vampire/32/9082_2.png) [@Vampire](https://discuss.gradle.org/u/Vampire)\
**Post date:** [January 21, 2025, 5:17pm UTC](https://discuss.gradle.org/t/i-am-getting-an-error-about-com-g00fy21-3-4/49366/11 "2025-01-21T17:17:13Z")

</div>

You try to resolve a Gradle plugin from Maven Central and Google repositories that is only available on Gradle Plugin Portal repository, check your plugin repositories and please don’t hijack threads with other topics but better create an own thread next time. 😉

---

<div class="post-metadata">

**Author:** ![kwu-work](https://avatars.discourse-cdn.com/v4/letter/k/c2a13f/32.png) [@kwu-work](https://discuss.gradle.org/u/kwu-work)\
**Post date:** [November 21, 2025, 4:09pm UTC](https://discuss.gradle.org/t/i-am-getting-an-error-about-com-g00fy21-3-4/49366/12 "2025-11-21T16:09:51Z")

</div>

Just created an account to share that the link below helped me, in case you landed here when searching for the same error:

> **[Neptune Software Community](https://community.neptune-software.com/topics/tips--tricks/blogs/how-to-fix--cordova--9-build-errors)**
>
> The place to start innovating
