# Gradle Build failed as ,Connection to https://repo1.maven.org refused

**URL:** https://discuss.gradle.org/t/gradle-build-failed-as-connection-to-https-repo1-maven-org-refused/12242
**Category:** Buildship
**Created:** [October 15, 2015, 8:59pm UTC](https://discuss.gradle.org/t/gradle-build-failed-as-connection-to-https-repo1-maven-org-refused/12242 "2015-10-15T20:59:21Z")
**Posts on this page:** 2
**Page:** 1

<div class="post-metadata">

### Author: ![Elanchezhian](https://avatars.discourse-cdn.com/v4/letter/e/848f3c/32.png) [@Elanchezhian](https://discuss.gradle.org/u/Elanchezhian)
#### Post date: [October 15, 2015, 8:59pm UTC](https://discuss.gradle.org/t/gradle-build-failed-as-connection-to-https-repo1-maven-org-refused/12242/1 "2015-10-15T20:59:21Z")

</div>

13:47:02.113 [DEBUG] [org.gradle.api.internal.artifacts.ivyservice.resolveengine.graph.ResolvedConfigurationDependencyGraphVisitor] Attaching :webapp:unspecified(dist) to its parents.  
13:47:02.113 [DEBUG] [org.gradle.api.internal.artifacts.ivyservice.resolveengine.oldresult.TransientConfigurationResultsBuilder] Flushing resolved configuration data in Binary store in C:\cygwin64\tmp\gradle3487453273418213861.bin. Wrote root :webapp:unspecified:dist.  
13:47:02.129 [DEBUG] [org.gradle.api.internal.tasks.execution.ExecuteAtMostOnceTaskExecuter] Finished executing task ':copyDistLibs’  
13:47:02.129 [INFO] [org.gradle.execution.taskgraph.AbstractTaskPlanExecutor] :copyDistLibs (Thread[main,5,main]) completed. Took 1 mins 25.411 secs.  
13:47:02.129 [DEBUG] [org.gradle.execution.taskgraph.AbstractTaskPlanExecutor] Task worker [Thread[main,5,main]] finished, busy: 1 mins 26.445 secs, idle: 0.0010 secs  
13:47:02.144 [ERROR] [org.gradle.BuildExceptionReporter]  
13:47:02.144 [ERROR] [org.gradle.BuildExceptionReporter] FAILURE: Build failed with an exception.  
13:47:02.144 [ERROR] [org.gradle.BuildExceptionReporter]  
13:47:02.144 [ERROR] [org.gradle.BuildExceptionReporter] \* What went wrong:  
13:47:02.144 [ERROR] [org.gradle.BuildExceptionReporter] Could not resolve all dependencies for configuration ‘:dist’.  
13:47:02.144 [ERROR] [org.gradle.BuildExceptionReporter] \> Could not resolve org.codehaus.groovy:groovy-all:2.3.7.  
13:47:02.144 [ERROR] [org.gradle.BuildExceptionReporter] Required by:  
13:47:02.144 [ERROR] [org.gradle.BuildExceptionReporter] :webapp:unspecified  
13:47:02.144 [ERROR] [org.gradle.BuildExceptionReporter] \> Could not GET ‘[https://repo1.maven.org/maven2/org/codehaus/groovy/groovy-all/2.3.7/groovy-all-2.3.7.pom](https://repo1.maven.org/maven2/org/codehaus/groovy/groovy-all/2.3.7/groovy-all-2.3.7.pom)’.  
13:47:02.144 [ERROR] [org.gradle.BuildExceptionReporter] \> Connection to [https://repo1.maven.org](https://repo1.maven.org) refused  
13:47:02.144 [ERROR] [org.gradle.BuildExceptionReporter] \> Could not resolve org.imgscalr:imgscalr-lib:4.2.  
13:47:02.144 [ERROR] [org.gradle.BuildExceptionReporter] Required by:  
13:47:02.144 [ERROR] [org.gradle.BuildExceptionReporter] :webapp:unspecified  
13:47:02.144 [ERROR] [org.gradle.BuildExceptionReporter] \> Could not GET ‘[https://repo1.maven.org/maven2/org/imgscalr/imgscalr-lib/4.2/imgscalr-lib-4.2.pom](https://repo1.maven.org/maven2/org/imgscalr/imgscalr-lib/4.2/imgscalr-lib-4.2.pom)’.  
13:47:02.144 [ERROR] [org.gradle.BuildExceptionReporter] \> Connection to [https://repo1.maven.org](https://repo1.maven.org) refused  
13:47:02.144 [ERROR] [org.gradle.BuildExceptionReporter] \> Could not resolve org.slf4j:slf4j-log4j12:1.6.1.  
13:47:02.144 [ERROR] [org.gradle.BuildExceptionReporter] Required by:  
13:47:02.144 [ERROR] [org.gradle.BuildExceptionReporter] :webapp:unspecified  
13:47:02.144 [ERROR] [org.gradle.BuildExceptionReporter] \> Could not GET ‘[https://repo1.maven.org/maven2/org/slf4j/slf4j-log4j12/1.6.1/slf4j-log4j12-1.6.1.pom](https://repo1.maven.org/maven2/org/slf4j/slf4j-log4j12/1.6.1/slf4j-log4j12-1.6.1.pom)’.  
13:47:02.144 [ERROR] [org.gradle.BuildExceptionReporter] \> Connection to [https://repo1.maven.org](https://repo1.maven.org) refused  
13:47:02.144 [ERROR] [org.gradle.BuildExceptionReporter] \> Could not resolve com.google.apis:google-api-services-youtube:v3-rev133-1.20.0.  
13:47:02.144 [ERROR] [org.gradle.BuildExceptionReporter] Required by:  
13:47:02.144 [ERROR] [org.gradle.BuildExceptionReporter] :webapp:unspecified  
13:47:02.144 [ERROR] [org.gradle.BuildExceptionReporter] \> Could not GET ‘[https://repo1.maven.org/maven2/com/google/apis/google-api-services-youtube/v3-rev133-1.20.0/google-api-services-youtube-v3-rev133-1.20.0.pom](https://repo1.maven.org/maven2/com/google/apis/google-api-services-youtube/v3-rev133-1.20.0/google-api-services-youtube-v3-rev133-1.20.0.pom)’.  
13:47:02.144 [ERROR] [org.gradle.BuildExceptionReporter] \> Connection to [https://repo1.maven.org](https://repo1.maven.org) refused  
13:47:02.144 [ERROR] [org.gradle.BuildExceptionReporter]  
13:47:02.144 [ERROR] [org.gradle.BuildExceptionReporter] \* Try:  
13:47:02.144 [ERROR] [org.gradle.BuildExceptionReporter] Run with --stacktrace option to get the stack trace.  
13:47:02.160 [LIFECYCLE] [org.gradle.BuildResultLogger]  
13:47:02.160 [LIFECYCLE] [org.gradle.BuildResultLogger] BUILD FAILED  
13:47:02.160 [LIFECYCLE] [org.gradle.BuildResultLogger]  
13:47:02.160 [LIFECYCLE] [org.gradle.BuildResultLogger] Total time: 1 mins 34.763 secs  
13:47:02.160 [DEBUG] [org.gradle.api.internal.tasks.compile.daemon.CompilerDaemonManager] Stopping 0 compiler daemon(s).  
13:47:02.160 [INFO] [org.gradle.api.internal.tasks.compile.daemon.CompilerDaemonManager] Stopped 0 compiler daemon(s).  
13:47:02.160 [DEBUG] [org.gradle.cache.internal.btree.BTreePersistentIndexedCache] Closing cache artifact-at-url.bin (C:\Users\exr2.gradle\caches\modules-2\metadata-2.14\artifact-at-url.bin)  
13:47:02.160 [DEBUG] [org.gradle.cache.internal.btree.BTreePersistentIndexedCache] Closing cache module-metadata.bin (C:\Users\exr2.gradle\caches\modules-2\metadata-2.14\module-metadata.bin)  
13:47:02.160 [DEBUG] [org.gradle.cache.internal.DefaultFileLockManager] Releasing lock on artifact cache (C:\Users\exr2.gradle\caches\modules-2).  
13:47:02.160 [DEBUG] [org.gradle.cache.internal.DefaultFileLockManager] Releasing lock on buildscript class cache for build file ‘C:\workspace\webapp\build.gradle’ (C:\Users\exr2.gradle\caches\2.2.1\scripts\build\_3hcyon8tmdjnfvxx6iiyjsuxw\ProjectScript\buildscript).  
13:47:02.160 [DEBUG] [org.gradle.cache.internal.DefaultFileLockManager] Releasing lock on no\_buildscript class cache for build file ‘C:\workspace\webapp\build.gradle’ (C:\Users\exr2.gradle\caches\2.2.1\scripts\build\_3hcyon8tmdjnfvxx6iiyjsuxw\ProjectScript\no\_buildscript).  
13:47:02.160 [DEBUG] [org.gradle.cache.internal.DefaultCacheAccess] Cache Plugin Resolution Cache (C:\Users\exr2.gradle\caches\2.2.1\plugin-resolution) was closed 0 times.  
13:47:02.160 [DEBUG] [org.gradle.cache.internal.DefaultCacheAccess] Cache task history cache (C:\workspace\webapp.gradle\2.2.1\taskArtifacts) was closed 0 times.  
13:47:02.160 [DEBUG] [org.gradle.api.internal.artifacts.ivyservice.ivyresolve.memcache.InMemoryCachedRepositoryFactory] In-memory dependency metadata cache closed. Repos cached: 1, cache instances: 1, modules served from cache: 0, artifacts: 0  
13:47:02.175 [DEBUG] [org.gradle.api.internal.artifacts.ivyservice.resolveengine.store.CachedStoreFactory] Resolution result cache closed. Cache reads: 0, disk reads: 0 (avg: 0.0 secs, total: 0.0 secs)  
13:47:02.175 [DEBUG] [org.gradle.api.internal.artifacts.ivyservice.resolveengine.store.CachedStoreFactory] Resolved configuration cache closed. Cache reads: 0, disk reads: 0 (avg: 0.0 secs, total: 0.0 secs)  
13:47:02.175 [DEBUG] [org.gradle.api.internal.artifacts.ivyservice.resolveengine.store.ResolutionResultsStoreFactory] Deleted 2 resolution results binary files in 0.0 secs

---

<div class="post-metadata">

### Author: ![etiennestuder](https://sea1.discourse-cdn.com/gradle/user_avatar/discuss.gradle.org/etiennestuder/32/7153_2.png) [@etiennestuder](https://discuss.gradle.org/u/etiennestuder)
#### Post date: [October 15, 2015, 9:21pm UTC](https://discuss.gradle.org/t/gradle-build-failed-as-connection-to-https-repo1-maven-org-refused/12242/2 "2015-10-15T21:21:21Z")

</div>

Posting some log output is not the appropriate way to post in this forum. Please describe your environment, what you did, what happened, and what you would have expected to happen.

Thanks, Etienne
