Got “Invalid Tmestamp” error when running gradle test

Here is what I got:

> Task :processTestResources FAILED

FAILURE: Build failed with an exception.

* What went wrong:
Execution failed for task ':processTestResources'.
> Invalid Timestamp -28800000 for 'file '/home/jerry/Documents/tai-e/src/test/resources/dataflow/livevar''.

* Try:
Run with --stacktrace option to get the stack trace. Run with --info or --debug option to get more log output. Run with --scan to get full insights.

* Get more help at https://help.gradle.org

BUILD FAILED in 1s
3 actionable tasks: 3 executed