# Failure running :app:compileFlutterBuildDebug

**URL:** <https://discuss.gradle.org/t/failure-running-compileflutterbuilddebug/45717>\
**Category:** Help/Discuss\
**Created:** [March 3, 2023, 5:03am UTC](https://discuss.gradle.org/t/failure-running-compileflutterbuilddebug/45717 "2023-03-03T05:03:20Z")\
**Posts on this page:** 2\
**Page:** 1

<div class="post-metadata">

**Author:** ![FarahRizwan](https://avatars.discourse-cdn.com/v4/letter/f/8edcca/32.png) [@FarahRizwan](https://discuss.gradle.org/u/FarahRizwan)\
**Post date:** [March 3, 2023, 5:03am UTC](https://discuss.gradle.org/t/failure-running-compileflutterbuilddebug/45717/1 "2023-03-03T05:03:20Z")

</div>

same issue here

```gradle
FAILURE: Build failed with an exception.

* Where:
Script '/Users/taimoor/Documents/flutter/packages/flutter_tools/gradle/flutter.gradle' line: 1159

* What went wrong:
Execution failed for task ':app:compileFlutterBuildDebug'.
> Process 'command '/Users/taimoor/Documents/flutter/bin/flutter'' finished with non-zero exit value 1

* Try:
> Run with --stacktrace option to get the stack trace.
> Run with --info or --debug option to get more log output.
> Run with --scan to get full insights.

* Get more help at https://help.gradle.org

BUILD FAILED in 8s
Exception: Gradle task assembleDebug failed with exit code 1

```

---

<div class="post-metadata">

**Author:** ![Vampire](https://sea1.discourse-cdn.com/gradle/user_avatar/discuss.gradle.org/vampire/32/9082_2.png) [@Vampire](https://discuss.gradle.org/u/Vampire)\
**Post date:** [March 3, 2023, 4:04pm UTC](https://discuss.gradle.org/t/failure-running-compileflutterbuilddebug/45717/2 "2023-03-03T16:04:49Z")

</div>

The information you provided is not enough to give any hint, scroll up to see more information or select a higher node in the tree on the left if you are using IntelliJ or Android Studio.
