# Does anyone know whether CodeNarc works with Java8?

**URL:** <https://discuss.gradle.org/t/does-anyone-know-whether-codenarc-works-with-java8/3644>\
**Category:** Old Forum Archive\
**Created:** [July 24, 2013, 10:26am UTC](https://discuss.gradle.org/t/does-anyone-know-whether-codenarc-works-with-java8/3644 "2013-07-24T10:26:00Z")\
**Posts on this page:** 2\
**Page:** 1

<div class="post-metadata">

**Author:** ![Schalk\_Cronje](https://sea1.discourse-cdn.com/gradle/user_avatar/discuss.gradle.org/schalk_cronje/32/6511_2.png) [@Schalk\_Cronje](https://discuss.gradle.org/u/Schalk_Cronje)\
**Post date:** [July 24, 2013, 10:26am UTC](https://discuss.gradle.org/t/does-anyone-know-whether-codenarc-works-with-java8/3644/1 "2013-07-24T10:26:00Z")

</div>

_(I understand that this might be better ask on a CodeNarc-specific forum, but as this is being used through the plugin, I thought I would start here)._

I am seeing the following issue when running CodeNarc tasks from Gradle:

Executing task ‘:dsl:codenarcMain’ due to:

No history is available. Loaded properties file in 155ms; 305 rules Loading ruleset from [file:/scratch/jenkins/workspace/Groovy\_VFS\_DSL\_Trunk\_Java8\_lambdas/config/codenarc/codenarc.xml] Loading ruleset from [rulesets/naming.xml] Loading ruleset from [rulesets/size.xml] Loading ruleset from [rulesets/groovyism.xml] RuleSet configuration properties file [codenarc.properties] not found. Analysis time=13413ms :dsl:codenarcMain FAILED

FAILURE: Build failed with an exception.

- What went wrong:

Execution failed for task ‘:dsl:codenarcMain’.

java.util.MissingResourceException: Can’t find bundle for base name codenarc-base-messages, locale en\_US

I can supply the full stacktrace if someones needs more info

---

<div class="post-metadata">

**Author:** ![Marcin](https://sea1.discourse-cdn.com/gradle/user_avatar/discuss.gradle.org/marcin/32/1870_2.png) [@Marcin](https://discuss.gradle.org/u/Marcin)\
**Post date:** [September 9, 2013, 7:47am UTC](https://discuss.gradle.org/t/does-anyone-know-whether-codenarc-works-with-java8/3644/2 "2013-09-09T07:47:00Z")

</div>

I have similar problem with OpenJDK 1.7.0.25 when try to build Gradle from Git. It works fine with Oracle Java 1.7.0.21.
