# CommandInvokationFailure: Gradle build failed

**URL:** <https://discuss.gradle.org/t/commandinvokationfailure-gradle-build-failed/39250>\
**Category:** Buildship\
**Created:** [March 9, 2021, 4:06pm UTC](https://discuss.gradle.org/t/commandinvokationfailure-gradle-build-failed/39250 "2021-03-09T16:06:18Z")\
**Posts on this page:** 2\
**Page:** 1

<div class="post-metadata">

**Author:** ![Bumme](https://sea1.discourse-cdn.com/gradle/user_avatar/discuss.gradle.org/bumme/32/9129_2.png) [@Bumme](https://discuss.gradle.org/u/Bumme)\
**Post date:** [March 9, 2021, 4:06pm UTC](https://discuss.gradle.org/t/commandinvokationfailure-gradle-build-failed/39250/1 "2021-03-09T16:06:18Z")

</div>

I’m actually Build an application with unity and continue to get this exception, someone have some suggestions?  
CommandInvokationFailure: Gradle build failed.  
/Library/Java/JavaVirtualMachines/jdk1.8.0\_281.jdk/Contents/Home/bin/java -classpath “/Applications/Unity/Hub/Editor/2018.4.11f1/PlaybackEngines/AndroidPlayer/Tools/gradle/lib/gradle-launcher-5.1.1.jar” org.gradle.launcher.GradleMain “-Dorg.gradle.jvmargs=-Xmx4096m” “assembleRelease”

stderr[

FAILURE: Build failed with an exception.

- What went wrong:  
A problem occurred configuring root project ‘gradleOut’.

> Failed to notify project evaluation listener.  
> org.gradle.api.tasks.compile.CompileOptions.setBootClasspath(Ljava/lang/String;)V

- Try:  
Run with --stacktrace option to get the stack trace. Run with --info or --debug option to get more log output. Run with --scan to get full insights.

- Get more help at [https://help.gradle.org](https://help.gradle.org)

BUILD FAILED in 8s  
]  
stdout[

]  
exit code: 1  
UnityEditor.Android.Command.WaitForProgramToRun (UnityEditor.Utils.Program p, UnityEditor.Android.Command+WaitingForProcessToExit waitingForProcessToExit, System.String errorMsg) (at :0)  
UnityEditor.Android.Command.Run (System.Diagnostics.ProcessStartInfo psi, UnityEditor.Android.Command+WaitingForProcessToExit waitingForProcessToExit, System.String errorMsg) (at :0)  
UnityEditor.Android.Command.Run (System.String command, System.String args, System.String workingdir, UnityEditor.Android.Command+WaitingForProcessToExit waitingForProcessToExit, System.String errorMsg) (at :0)  
UnityEditor.Android.AndroidJavaTools.RunJava (System.String args, System.String workingdir, System.Action`1[T] progress, System.String error) (at <df45ca7b334d4b918976307f9d26db2e>:0) UnityEditor.Android.GradleWrapper.Run (UnityEditor.Android.AndroidJavaTools javaTools, System.String workingdir, System.String task, System.Action`1[T] progress) (at :0)  
Rethrow as GradleInvokationException: Gradle build failed  
UnityEditor.Android.GradleWrapper.Run (UnityEditor.Android.AndroidJavaTools javaTools, System.String workingdir, System.String task, System.Action`1[T] progress) (at :0)  
UnityEditor.Android.PostProcessor.Tasks.BuildGradleProject.Execute (UnityEditor.Android.PostProcessor.PostProcessorContext context) (at :0)  
UnityEditor.Android.PostProcessor.PostProcessRunner.RunAllTasks (UnityEditor.Android.PostProcessor.PostProcessorContext context) (at :0)  
UnityEngine.GUIUtility:ProcessEvent(Int32, IntPtr)

---

<div class="post-metadata">

**Author:** ![Vampire](https://sea1.discourse-cdn.com/gradle/user_avatar/discuss.gradle.org/vampire/32/9082_2.png) [@Vampire](https://discuss.gradle.org/u/Vampire)\
**Post date:** [March 12, 2021, 11:22pm UTC](https://discuss.gradle.org/t/commandinvokationfailure-gradle-build-failed/39250/2 "2021-03-12T23:22:38Z")

</div>

Do as the error message suggests and run with `--stacktrace` to get the actual stack trace of the error
