# AAPT2 Daemon startup failed

**URL:** <https://discuss.gradle.org/t/aapt2-daemon-startup-failed/32358>\
**Category:** Help/Discuss\
**Created:** [July 10, 2019, 8:08am UTC](https://discuss.gradle.org/t/aapt2-daemon-startup-failed/32358 "2019-07-10T08:08:50Z")\
**Posts on this page:** 8\
**Page:** 1

<div class="post-metadata">

**Author:** ![poulwalker](https://avatars.discourse-cdn.com/v4/letter/p/8491ac/32.png) [@poulwalker](https://discuss.gradle.org/u/poulwalker)\
**Post date:** [July 10, 2019, 8:08am UTC](https://discuss.gradle.org/t/aapt2-daemon-startup-failed/32358/1 "2019-07-10T08:08:50Z")

</div>

this is my build.gradle  
// Top-level build file where you can add configuration options common to all sub-projects/modules.

buildscript {  
repositories {  
google()  
jcenter()

```
}
dependencies {
    classpath 'com.android.tools.build:gradle:3.4.2'
    
    // NOTE: Do not place your application dependencies here; they belong
    // in the individual module build.gradle files
}

```

}

allprojects {  
repositories {  
google()  
jcenter()

```
}

```

}

task clean(type: Delete) {  
delete rootProject.buildDir  
}

this is my logs:

- Exception is:  
org.gradle.api.tasks.TaskExecutionException: Execution failed for task ‘:app:mergeDebugResources’.  
at org.gradle.api.internal.tasks.execution.ExecuteActionsTaskExecuter.execute(ExecuteActionsTaskExecuter.java:95)  
at org.gradle.api.internal.tasks.execution.ResolveTaskOutputCachingStateExecuter.execute(ResolveTaskOutputCachingStateExecuter.java:91)  
at org.gradle.api.internal.tasks.execution.ValidatingTaskExecuter.execute(ValidatingTaskExecuter.java:57)  
at org.gradle.api.internal.tasks.execution.SkipEmptySourceFilesTaskExecuter.execute(SkipEmptySourceFilesTaskExecuter.java:119)  
at org.gradle.api.internal.tasks.execution.ResolvePreviousStateExecuter.execute(ResolvePreviousStateExecuter.java:43)  
at org.gradle.api.internal.tasks.execution.CleanupStaleOutputsExecuter.execute(CleanupStaleOutputsExecuter.java:93)  
at org.gradle.api.internal.tasks.execution.FinalizePropertiesTaskExecuter.execute(FinalizePropertiesTaskExecuter.java:45)  
at org.gradle.api.internal.tasks.execution.ResolveTaskArtifactStateTaskExecuter.execute(ResolveTaskArtifactStateTaskExecuter.java:94)  
at org.gradle.api.internal.tasks.execution.SkipTaskWithNoActionsExecuter.execute(SkipTaskWithNoActionsExecuter.java:56)  
at org.gradle.api.internal.tasks.execution.SkipOnlyIfTaskExecuter.execute(SkipOnlyIfTaskExecuter.java:55)  
at org.gradle.api.internal.tasks.execution.CatchExceptionTaskExecuter.execute(CatchExceptionTaskExecuter.java:36)  
at org.gradle.api.internal.tasks.execution.EventFiringTaskExecuter$1.executeTask(EventFiringTaskExecuter.java:67)  
at org.gradle.api.internal.tasks.execution.EventFiringTaskExecuter$1.call(EventFiringTaskExecuter.java:52)  
at org.gradle.api.internal.tasks.execution.EventFiringTaskExecuter$1.call(EventFiringTaskExecuter.java:49)  
at org.gradle.internal.operations.DefaultBuildOperationExecutor$CallableBuildOperationWorker.execute(DefaultBuildOperationExecutor.java:315)  
at org.gradle.internal.operations.DefaultBuildOperationExecutor$CallableBuildOperationWorker.execute(DefaultBuildOperationExecutor.java:305)  
at org.gradle.internal.operations.DefaultBuildOperationExecutor.execute(DefaultBuildOperationExecutor.java:175)  
at org.gradle.internal.operations.DefaultBuildOperationExecutor.call(DefaultBuildOperationExecutor.java:101)  
at org.gradle.internal.operations.DelegatingBuildOperationExecutor.call(DelegatingBuildOperationExecutor.java:36)  
at org.gradle.api.internal.tasks.execution.EventFiringTaskExecuter.execute(EventFiringTaskExecuter.java:49)  
at org.gradle.execution.plan.LocalTaskNodeExecutor.execute(LocalTaskNodeExecutor.java:43)  
at org.gradle.execution.taskgraph.DefaultTaskExecutionGraph$InvokeNodeExecutorsAction.execute(DefaultTaskExecutionGraph.java:355)  
at org.gradle.execution.taskgraph.DefaultTaskExecutionGraph$InvokeNodeExecutorsAction.execute(DefaultTaskExecutionGraph.java:343)  
at org.gradle.execution.taskgraph.DefaultTaskExecutionGraph$BuildOperationAwareExecutionAction.execute(DefaultTaskExecutionGraph.java:336)  
at org.gradle.execution.taskgraph.DefaultTaskExecutionGraph$BuildOperationAwareExecutionAction.execute(DefaultTaskExecutionGraph.java:322)  
at org.gradle.execution.plan.DefaultPlanExecutor$ExecutorWorker$1.execute(DefaultPlanExecutor.java:134)  
at org.gradle.execution.plan.DefaultPlanExecutor$ExecutorWorker$1.execute(DefaultPlanExecutor.java:129)  
at org.gradle.execution.plan.DefaultPlanExecutor$ExecutorWorker.execute(DefaultPlanExecutor.java:202)  
at org.gradle.execution.plan.DefaultPlanExecutor$ExecutorWorker.executeNextNode(DefaultPlanExecutor.java:193)  
at org.gradle.execution.plan.DefaultPlanExecutor$ExecutorWorker.run(DefaultPlanExecutor.java:129)  
at org.gradle.internal.concurrent.ExecutorPolicy$CatchAndRecordFailures.onExecute(ExecutorPolicy.java:63)  
at org.gradle.internal.concurrent.ManagedExecutorImpl$1.run(ManagedExecutorImpl.java:46)  
at org.gradle.internal.concurrent.ThreadFactoryImpl$ManagedThreadRunnable.run(ThreadFactoryImpl.java:55)  
Caused by: com.android.ide.common.workers.WorkerExecutorException: 8 exceptions were raised by workers:  
com.android.builder.internal.aapt.v2.Aapt2InternalException: AAPT2 aapt2-3.4.2-5326820-windows Daemon #0: Daemon startup failed  
This should not happen under normal circumstances, please file an issue if it does.  
com.android.builder.internal.aapt.v2.Aapt2InternalException: AAPT2 aapt2-3.4.2-5326820-windows Daemon #1: Daemon startup failed  
This should not happen under normal circumstances, please file an issue if it does.  
com.android.builder.internal.aapt.v2.Aapt2InternalException: AAPT2 aapt2-3.4.2-5326820-windows Daemon #2: Daemon startup failed  
This should not happen under normal circumstances, please file an issue if it does.  
com.android.builder.internal.aapt.v2.Aapt2InternalException: AAPT2 aapt2-3.4.2-5326820-windows Daemon #3: Daemon startup failed  
This should not happen under normal circumstances, please file an issue if it does.  
com.android.builder.internal.aapt.v2.Aapt2InternalException: AAPT2 aapt2-3.4.2-5326820-windows Daemon #4: Daemon startup failed  
This should not happen under normal circumstances, please file an issue if it does.  
com.android.builder.internal.aapt.v2.Aapt2InternalException: AAPT2 aapt2-3.4.2-5326820-windows Daemon #5: Daemon startup failed  
This should not happen under normal circumstances, please file an issue if it does.  
com.android.builder.internal.aapt.v2.Aapt2InternalException: AAPT2 aapt2-3.4.2-5326820-windows Daemon #6: Daemon startup failed  
This should not happen under normal circumstances, please file an issue if it does.  
com.android.builder.internal.aapt.v2.Aapt2InternalException: AAPT2 aapt2-3.4.2-5326820-windows Daemon #7: Daemon startup failed  
This should not happen under normal circumstances, please file an issue if it does.

- Get more help at [https://help.gradle.org](https://help.gradle.org)

BUILD FAILED in 1s  
10 actionable tasks: 8 executed, 2 up-to-date  
Build step ‘Execute Windows batch command’ marked build as failure  
[WS-CLEANUP] Deleting project workspace…[WS-CLEANUP] done  
Finished: FAILURE

---

<div class="post-metadata">

**Author:** ![ahmad583](https://avatars.discourse-cdn.com/v4/letter/a/dfb087/32.png) [@ahmad583](https://discuss.gradle.org/u/ahmad583)\
**Post date:** [July 15, 2019, 9:06am UTC](https://discuss.gradle.org/t/aapt2-daemon-startup-failed/32358/2 "2019-07-15T09:06:18Z")

</div>

I have faced the same issue. Have you resolved it???

---

<div class="post-metadata">

**Author:** ![adammizam](https://avatars.discourse-cdn.com/v4/letter/a/8baadc/32.png) [@adammizam](https://discuss.gradle.org/u/adammizam)\
**Post date:** [July 18, 2019, 2:13am UTC](https://discuss.gradle.org/t/aapt2-daemon-startup-failed/32358/3 "2019-07-18T02:13:15Z")

</div>

Any solution??.. i get this error also and i already do little bit of search about it, most of the solution that available suggesting to migrate to androidX but unfortunately it’s not working for me.

---

<div class="post-metadata">

**Author:** ![cjjijo](https://avatars.discourse-cdn.com/v4/letter/c/cdc98d/32.png) [@cjjijo](https://discuss.gradle.org/u/cjjijo)\
**Post date:** [July 18, 2019, 3:06am UTC](https://discuss.gradle.org/t/aapt2-daemon-startup-failed/32358/4 "2019-07-18T03:06:03Z")

</div>

I am facing to the similar problem. Every forum suggest to migrate to androidX. but if we migrate then also exists the same problem.

---

<div class="post-metadata">

**Author:** ![cjjijo](https://avatars.discourse-cdn.com/v4/letter/c/cdc98d/32.png) [@cjjijo](https://discuss.gradle.org/u/cjjijo)\
**Post date:** [July 18, 2019, 3:20am UTC](https://discuss.gradle.org/t/aapt2-daemon-startup-failed/32358/5 "2019-07-18T03:20:08Z")

</div>

Please degrade gradle to 3.3.2, I had degrade to 3.3.2 then its working. But it is not the right solution.

---

<div class="post-metadata">

**Author:** ![adammizam](https://avatars.discourse-cdn.com/v4/letter/a/8baadc/32.png) [@adammizam](https://discuss.gradle.org/u/adammizam)\
**Post date:** [July 18, 2019, 7:11am UTC](https://discuss.gradle.org/t/aapt2-daemon-startup-failed/32358/6 "2019-07-18T07:11:28Z")

</div>

Hi there, i already solve my problem by downgrade the firebase. My problem occur because of the firebase library.

//The firebase the one that has problem  
implementation ‘com.google.firebase:firebase-core:17.0.1’  
implementation ‘com.google.firebase:firebase-database:18.0.0’  
implementation ‘com.google.firebase:firebase-messaging:17.3.4’  
implementation ‘com.firebaseui:firebase-ui-database:1.2.0’

//I have downgrade it to this version  
implementation ‘com.firebaseui:firebase-ui-database:1.2.0’  
implementation ‘com.google.firebase:firebase-messaging:17.3.4’  
implementation ‘com.google.firebase:firebase-auth:16.0.5’  
implementation ‘com.google.firebase:firebase-database:16.0.4’  
implementation ‘com.google.firebase:firebase-storage:16.0.4’

I’m not sure either this one can help you guys or not. I’m still new in programming world.

---

<div class="post-metadata">

**Author:** ![mathiasn](https://avatars.discourse-cdn.com/v4/letter/m/e56c9b/32.png) [@mathiasn](https://discuss.gradle.org/u/mathiasn)\
**Post date:** [July 18, 2019, 5:38pm UTC](https://discuss.gradle.org/t/aapt2-daemon-startup-failed/32358/7 "2019-07-18T17:38:06Z")

</div>

Hello,  
I found the solution in this thread: [https://stackoverflow.com/questions/50279792/could-not-find-com-android-tools-buildaapt23-2-0](https://stackoverflow.com/questions/50279792/could-not-find-com-android-tools-buildaapt23-2-0)

Simply add the google dependency on allprojects section fixed it for me

---

<div class="post-metadata">

**Author:** ![debashish](https://avatars.discourse-cdn.com/v4/letter/d/54ee81/32.png) [@debashish](https://discuss.gradle.org/u/debashish)\
**Post date:** [March 29, 2020, 12:17pm UTC](https://discuss.gradle.org/t/aapt2-daemon-startup-failed/32358/8 "2020-03-29T12:17:46Z")

</div>

It worked for me . thank you so much. I was struggling for days. there was unnecessary error that was showing for "universal c runtime windows " installation.
